CVE and update status of the FreeBSD ports tree4,826 unaddressed CVEs in 618 portsAll times are CET

Port details

java/openjfx1414.0.2.1+1_21

JavaFX SDK overlay for OpenJDK 11

Maintainer
ports@FreeBSD.org
Packages
openjfx14 14.0.2.1+1_21
Upstream
Higher version available: 28.14
CPE
none, CVEs only via VuXML
WWW
https://openjdk.java.net/projects/openjfx/
Links
cgit · VuXML

Unaddressed (0) · The CVE record lists this version as affected, no VuXML entry names the CVE

None. There is no CVE without a VuXML entry for this version.

VuXML only (0) · listed, port not fixed yet

None. pkg audit reports nothing for this version.

Fixed (0)

No VuXML entries for this package.

Commits (54)

Harald Eilertsen (haraldei) · 14.0.2.1+1_21
java/openjfx14: Fix openjfx14 after 9477c9da0a4

Removing USE_LDCONFIG from openjdk11 caused the package for openjfx14 to
fail to build, because it could not find libjvm.so, previously exported
from openjdk11 (and 8).

Making the openjfx14 package ignore this should be safe, as it in any
case relies on openjdk11 which again contains the lib and knows how to
locate and load it.

Thanks to ronald@ for pointing me in the right direction!

PR:		297282
Reported by:	vvd@FreeBSD.org
Reviewed by:	vvd@FreeBSD.org
Tested by:	vvd@FreeBSD.org
Sponsored by:	The FreeBSD Foundation
Differential Revision:	https://reviews.freebsd.org/D59290
cfb60c1505
Ronald Klop (ronald) · 14.0.2.1+1_20
*/*: bump portrevision after java_default=25 update

Included all ports that have USES=java.

PR:	293559
86813e9ccf
Thierry Thomas (thierry) · 14.0.2.1+1_19
*/*: undeprecate after the upgrade of FFmpeg4

PR:		293842, 293822, 293823, 293824, 293825, 293826, 278913, 293827, 270198, 270248, 270206, 293828, 261302, 270281, 270214, 270276, 270314
39dc34dc79
Daniel Engberg (diizzy) · 14.0.2.1+1_19
*/*: Deprecate and set expiration date to 2026-06-30 on FFmpeg 4 consumers

To follow up on 15dea205dcd006fb94a96d7ffafd617e3ba4201d deprecate and
set expiration date on direct FFmpeg 4 consumers.

PR:		293822, 293823, 293824, 293825, 293826, 278913, 293827
		270198, 270248, 270206, 293828, 261302, 270281, 270214
		270276, 270314
44f2f1412b
Ronald Klop (ronald) · 14.0.2.1+1_19
*/*: bump portrevision after java_default=21 update

PR:	272855
2baaf16375
Po-Chuan Hsieh (sunpoet) · 14.0.2.1+1_18
java/openjfx14: Fix a67f24e318a6966aa0f191de2c49f1fb687fde6e

Simplify RUBY_VER check

PR:		293109
Reported by:	Benjamin Takacs <nimaje+fbz@bureaucracy.de>
c2fa1c94c1
Vladimir Druzenko (vvd) · 14.0.2.1+1_18
java/openjfx14: Fix a67f24e318a6966aa0f191de2c49f1fb687fde6e

Fix build with WEBKIT=off.
RUBY_VER variable is only defined with USES=ruby, which is only the
case if the WEBKIT option is on.

While here move LDFLAGS higher.

PR:	293109
Fixes:	a67f24e318a6 (Fix 066663be20a8d55bde6ec67c54dbdaeafcf04fea)
8879f34c4c
Po-Chuan Hsieh (sunpoet) · 14.0.2.1+1_18
java/openjfx14: Fix 066663be20a8d55bde6ec67c54dbdaeafcf04fea

rubygem-getoptlong is a conditional dependency.

PR:		292489
a67f24e318
Vladimir Druzenko (vvd) · 14.0.2.1+1_18
java/openjfx14: Fix build with ruby 3.4

/usr/local/lib/ruby/3.4/did_you_mean/core_ext/name_error.rb:11: warning: getoptlong is not part of the default gems starting from Ruby 3.4.0. Install getoptlong from RubyGems.
<internal:/usr/local/lib/ruby/3.4/rubygems/core_ext/kernel_require.rb>:136:in 'Kernel#require': cannot load such file -- getoptlong (LoadError)

PR:	292489
066663be20
Baptiste Daroussin (bapt) · 14.0.2.1+1_18
multimedia/ffmpeg: bump revision to chase lib version change
18ea9c7108
Vladimir Druzenko (vvd) · 14.0.2.1+1_17
java/openjfx14: Unbreak after update libxm2 to 2.14

PR:	280158
f96941abd9
Daniel Engberg (diizzy) · 14.0.2.1+1_16
java/openjfx14: Mark BROKEN

Fails to build with libxml2 2.13+, error: no matching constructor for initialization of 'XMLDocumentParserScope'

PR:		280158
17eb38d5dc
Charlie Li (vishwin) · 14.0.2.1+1_16
gnome.mk: rename gdkpixbuf2 to gdkpixbuf to prepare for port move

The GTK 1-based gdk-pixbuf has not existed for some time.

No functional or package changes.
e87d8134a3
Daniel Engberg (diizzy) · 14.0.2.1+1_16
*/*: Bump consumers of devel/icu

...to avoid library mismatches
ff33dd4700
Muhammad Moinur Rahman (bofh) · 14.0.2.1+1_15
Mk/Uses/java.mk: Runtime fix with USES=java:ant

USES=java:ant does not imply USES=java:run so we need to add the run arg
seperately when we are using USES=java:ant. Not all ports require the
the argument so it is better to address the ports individually instead
of handling it automatically by implying run for ant.

Thanks to vvd for carefully going through this.

Reported by:	vvd
Approved by:	portmgr (blanket)
ac7a7d6fe1
Muhammad Moinur Rahman (bofh) · 14.0.2.1+1_15
Mk/**java.mk: Convert bsd.java.mk to USES

The following features have been added or changed:
- Instead of USE_JAVA use USES=java. This defaults to
  USES=java:build,run if NO_BUILD is undefined. Else it defaults to
  USES=java:run
- Instead of USE_ANT=yes use USES=java:ant which also implies
  USES=java:build
- Instead of JAVA_BUILD=yes use USES=java:build. Does not imply run or
  extract
- Instead of JAVA_EXTRACT=yes use USES=java:extract does not imply
  build or run
- Instead of JAVA_RUN=yes use USES=java:run does not imply extract or
  build
- Instead of USE_JAVA=<version> use USES=java and JAVA_VERSION=<version>

Approved by: mat (portmgr), glewis
Differential Revision:  https://reviews.freebsd.org/D48201
0835676e36
Dimitry Andric (dim) · 14.0.2.1+1_15
java/openjfx14: fix build with clang 19

Clang 19 now implements CWG 96 [1], which requires a template argument
list after a 'template' keyword, resulting in errors similar to:

  /wrkdirs/usr/ports/java/openjfx14/work/jfx-14.0.2.1-1/modules/javafx.web/src/main/native/Source/JavaScriptCore/assembler/AbstractMacroAssembler.h:923:65: error: a template argument list is expected after a name prefixed by the template keyword [-Wmissing-template-arg-list-after-template-kw]
    923 |         AssemblerType::repatchCompact(dataLabelCompact.template dataLocation(), value);
        |                                                                 ^
  /wrkdirs/usr/ports/java/openjfx14/work/jfx-14.0.2.1-1/modules/javafx.web/src/main/native/Source/JavaScriptCore/runtime/JSCast.h:146:33: error: a template argument list is expected after a name prefixed by the template keyword [-Wmissing-template-arg-list-after-template-kw]
    146 |     return Dispatcher::template inherits(vm, from);
        |                                 ^
  /wrkdirs/usr/ports/java/openjfx14/work/jfx-14.0.2.1-1/modules/javafx.web/src/main/native/Source/JavaScriptCore/runtime/JSCast.h:155:37: error: a template argument list is expected after a name prefixed by the template keyword [-Wmissing-template-arg-list-after-template-kw]
    155 |     if (LIKELY(Dispatcher::template inherits(vm, from)))
        |                                     ^
  /wrkdirs/usr/ports/java/openjfx14/work/jfx-14.0.2.1-1/modules/javafx.web/src/main/native/Source/JavaScriptCore/llint/LLIntData.h:159:75: error: a template argument list is expected after a name prefixed by the template keyword [-Wmissing-template-arg-list-after-template-kw]
    159 |     return reinterpret_cast<LLIntCode>(getCodePtr<tag>(opcodeID).template executableAddress());
        |                                                                           ^

In all these cases, appending "<>" is enough to satisfy the constraint.

[1] https://www.open-std.org/jtc1/sc22/wg21/docs/cwg_defects.html#96

PR:		282473
MFH:		2024Q4
aa9dd58652
Rene Ladan (rene) · 14.0.2.1+1_15
all: drop support for expired FreeBSD 14.0

Simplify expressions for FreeBSD 13.X

Reviewed by:	many

Differential Revision:	https://reviews.freebsd.org/D46601
4485bd8221
Piotr Kubaj (pkubaj) · 14.0.2.1+1_15
java/openjfx14: fix build on non-amd64

cc: error: unsupported option '-msse2' for target 'powerpc64-unknown-freebsd14.1'
26de591885
Max Brazhnikov (makc) · 14.0.2.1+1_15
*/*: clean up after swith to cmake:indirect
bc80854f3b
Max Brazhnikov (makc) · 14.0.2.1+1_15
*/*: convert to cmake:indirect

Convert bunch of ports to USES=cmake:indirect
43d9a1336d
Nuno Teixeira (eduardo) · 14.0.2.1+1_15
*/*: Bump consumers of x11-toolkits/gtk30

New version of gtk3 in tree
3572ca3e01
Jan Beich (jbeich) · 14.0.2.1+1_14
devel/icu: update to 74.1

Changes:	https://github.com/unicode-org/icu/releases/tag/release-74-1
Reported by:	GitHub (watch releases)
PR:		274317
Exp-run by:	antoine (incomplete)
Approved by:	fluffy
e55b80195e
Dimitry Andric (dim) · 14.0.2.1+1_13
java/openjfx14: fix build with lld 17

Building java/openjfx14 with lld 17 results in the following link
errors:

  ld: error: version script assignment of 'SUNWprivate_1.0' to symbol '_ZN3WTF6StringC1EPKtj' failed: symbol not defined
  ld: error: version script assignment of 'SUNWprivate_1.0' to symbol '_ZN3WTF8LockBase8lockSlowEv' failed: symbol not defined
  ld: error: version script assignment of 'SUNWprivate_1.0' to symbol '_ZN3WTF8LockBase10unlockSlowEv' failed: symbol not defined
  ld: error: version script assignment of 'SUNWprivate_1.0' to symbol '_ZN3WTF10fastMallocEj' failed: symbol not defined
  ld: error: version script assignment of 'SUNWprivate_1.0' to symbol '_ZN3WTF16fastZeroedMallocEj' failed: symbol not defined
  ld: error: version script assignment of 'SUNWprivate_1.0' to symbol '_ZNK3WTF10StringView23underlyingStringIsValidEv' failed: symbol not defined
  ld: error: version script assignment of 'SUNWprivate_1.0' to symbol 'Java_com_sun_webkit_dom_DOMSelectionImpl_addRangeImpl' failed: symbol not defined
  ld: error: version script assignment of 'SUNWprivate_1.0' to symbol 'Java_com_sun_webkit_dom_DOMSelectionImpl_collapseImpl' failed: symbol not defined
  ld: error: version script assignment of 'SUNWprivate_1.0' to symbol 'Java_com_sun_webkit_dom_DOMSelectionImpl_collapseToEndImpl' failed: symbol not defined
  ld: error: version script assignment of 'SUNWprivate_1.0' to symbol 'Java_com_sun_webkit_dom_DOMSelectionImpl_collapseToStartImpl' failed: symbol not defined
  ld: error: version script assignment of 'SUNWprivate_1.0' to symbol 'Java_com_sun_webkit_dom_DOMSelectionImpl_containsNodeImpl' failed: symbol not defined
  ld: error: version script assignment of 'SUNWprivate_1.0' to symbol 'Java_com_sun_webkit_dom_DOMSelectionImpl_deleteFromDocumentImpl' failed: symbol not defined
  ld: error: version script assignment of 'SUNWprivate_1.0' to symbol 'Java_com_sun_webkit_dom_DOMSelectionImpl_dispose' failed: symbol not defined
  ld: error: version script assignment of 'SUNWprivate_1.0' to symbol 'Java_com_sun_webkit_dom_DOMSelectionImpl_emptyImpl' failed: symbol not defined
  ld: error: version script assignment of 'SUNWprivate_1.0' to symbol 'Java_com_sun_webkit_dom_DOMSelectionImpl_extendImpl' failed: symbol not defined
  ld: error: version script assignment of 'SUNWprivate_1.0' to symbol 'Java_com_sun_webkit_dom_DOMSelectionImpl_getAnchorNodeImpl' failed: symbol not defined
  ld: error: version script assignment of 'SUNWprivate_1.0' to symbol 'Java_com_sun_webkit_dom_DOMSelectionImpl_getAnchorOffsetImpl' failed: symbol not defined
  ld: error: version script assignment of 'SUNWprivate_1.0' to symbol 'Java_com_sun_webkit_dom_DOMSelectionImpl_getBaseNodeImpl' failed: symbol not defined
  ld: error: version script assignment of 'SUNWprivate_1.0' to symbol 'Java_com_sun_webkit_dom_DOMSelectionImpl_getBaseOffsetImpl' failed: symbol not defined
  ld: error: version script assignment of 'SUNWprivate_1.0' to symbol 'Java_com_sun_webkit_dom_DOMSelectionImpl_getExtentNodeImpl' failed: symbol not defined

This is because lld 17 defaults to errors when undefined symbols are
referenced in linker version scripts. Suppress the errors since
openjfx14 is mostly unmaintained.

PR:		273753
MFH:		2023Q4
e0c21e404e
Daniel Engberg (diizzy) · 14.0.2.1+1_13
*/*: Bump jpeg-turbo users treewide

New major version 3.0.0
664a2fa1e5
Muhammad Moinur Rahman (bofh) · 14.0.2.1+1_12
*/*: Fix build with llvm16 on 13.2-STABLE

As like as HEAD(14.0-RELEASE) llvm16 was merged in base for 13.2-STABLE
with the OSVERSION 1302507.

- Utilize USE_CXXSTD=c++14 or similar solution where applicable
- Update conditionals to addtionally check for OSVERSION greater than
  1302507 and less than 1400000

Approved by:	portmgr (blanket)
Sponsored by:	The FreeBSD Foundation
95274bf4f9
Rene Ladan (rene) · 14.0.2.1+1_12
all: remove explicit versions in USES=python for "3.x+"

The logic in USES=python will automatically convert this to 3.8+ by
itself.

Adjust two ports that only had Python 3.7 mentioned but build fine
on Python 3.8 too.

finance/quickfix: mark BROKEN with PYTHON

libtool: compile:  c++ -DHAVE_CONFIG_H -I. -I../.. -I -I. -I.. -I../.. -I../C++ -DLIBICONV_PLUG -DPYTHON_MAJOR_VERSION=3 -Wno-unused-variable -Wno-maybe-uninitialized -O2 -pipe -DLIBICONV_PLUG -fstack-protector-strong -fno-strict-aliasing -DLIBICONV_PLUG -Wall -ansi -Wno-unused-command-line-argument -Wpointer-arith -Wwrite-strings -Wno-overloaded-virtual -Wno-deprecated-declarations -Wno-deprecated -std=c++0x -MT _quickfix_la-QuickfixPython.lo -MD -MP -MF .deps/_quickfix_la-QuickfixPython.Tpo -c QuickfixPython.cpp  -fPIC -DPIC -o .libs/_quickfix_la-QuickfixPython.o
warning: unknown warning option '-Wno-maybe-uninitialized'; did you mean '-Wno-uninitialized'? [-Wunknown-warning-option]
QuickfixPython.cpp:175:11: fatal error: 'Python.h' file not found
          ^~~~~~~~~~
1 warning and 1 error generated.

Reviewed by:	portmgr, vishwin, yuri
Differential Revision:	<https://reviews.freebsd.org/D40568>
3d9a815d9c
Muhammad Moinur Rahman (bofh) · 14.0.2.1+1_12
java/openjfx14: Fix build with llvm16

Sponsored by:	The FreeBSD Foundation
3a8cd0d0c8
Daniel Engberg (diizzy) · 14.0.2.1+1_12
*/*: Bump all users of multimedia/ffmpeg*

...to make sure all picks up new version(s)
f7accb23bf
Daniel Engberg (diizzy) · 14.0.2.1+1_11
java/openjfx14: Move to FFmpeg 4

Fails to build with FFmpeg 6

PR:		261302
Reported by:	antoine (via exp-run)
Approved by:	portmgr (blanket, build fix)
Sponsored by:	Blinkinblox
1c4a5a439b
Christian Weisgerber (naddy) · 14.0.2.1+1_11
audio/opus: bump consumers after update to 1.4
feb1fa34f5
Jan Beich (jbeich) · 14.0.2.1+1_10
devel/icu: update to 73.1

- Temporarily switch to GitHub auto archive (release artifacts are N/A atm)

Changes:	https://github.com/unicode-org/icu/releases/tag/release-73-1
Reported by:	GitHub (watch releases)
PR:		270422
Exp-run by:	antoine
f1f1a8be88
Tobias C. Berner (tcberner) · 14.0.2.1+1_9
accessibility/at-spi2-core: update to 2.46.0

What's new in at-spi2-core 2.46.0:
* Fix GetInterfaces documentation on org.a11y.atspi.Accessible
  interface.

What's new in at-spi2-core 2.45.91:
* Send device event controller events using the same signature as other
  events.
* Document the Accessible, Action, and Cache dbus interfaces.
* Fix license of atspi-gmain.c (#87).

What's new in at-spi2-core 2.45.90:
* xml: Add some documentation.
* xml: Fix event arguments.
* xml: Add some missing DeviceEventController methods.
* Bind the AT-SPI bus to the graphical session.
* Mark bus service as belonging to the session slice.
* Add ATSPI_ROLE_PUSH_BUTTON_MENU.
* Add an "announcement" event/signal to allow objects to send
  notifications (!63).
* Various code clean-ups and test improvements.

What's new in at-spi2-core 2.45.1:
* Atk and at-spi2-atk are now merged into this project.
* Now requires meson 0.56.2 and glib 2.67.4.
* at-spi2-atk: Expose the accessible hierarchy via dbus introspection.
* Properly escape the AT-SPI bus address; fixes warnings about the address
  not containing a colon (!55).
* Add a text value to AtspiValue, so that a value can expose a textual
  description, as in the new Atk value API.
* Add atspi_event_listener_register_with_app, to allow an event listener
  to be registered only for a given application (!52).

- accessibility/atk and accessibility/at-spi2-atk have been merged into
  accessibility/at-spi2-core

- accessibility/at-spi2-core: bump consumers of removed ports atk and at-spi2-atk

PR:		269704
Exp-run by:	antoine
---
fa81a4f5f8
Mikael Urankar (mikael) · 14.0.2.1+1_8
java/openjfx14: Drop maintainership
607ecddd93
Mikael Urankar (mikael) · 14.0.2.1+1_8
java/openjfx14: unbreak build with LLVM15

Pass -Wno-int-conversion to CFLAGS fixes error with strict conversion rules introduced in LLVM15

/wrkdirs/usr/ports/java/openjfx14/work/jfx-14.0.2.1-1/modules/javafx.graphics/src/main/native-font/pango.c:245:73: error: incompatible integer to pointer conversion passing 'jlong' (aka 'long long') to parameter of type 'void *' [-Wint-conversion]
                rc = (jboolean)((jboolean (*)(void *, const char *))fp)(arg0, text);
                                                                        ^~~~
17ec21b2ab
Muhammad Moinur Rahman (bofh) · 14.0.2.1+1_8
*/*: Fix some ports conversion from USE_RUBY to USES=ruby

In my previous commit 18c6e18 I missed some ports where RUBY was
optional. This commit fixes those missing ports and fixes INDEX build.

Approved by:	portmgr
Fixes: 18c6e18 Mk/**ruby.mk: Switch from USE_RUBY=yes to USES=ruby
2d00178fd4
Muhammad Moinur Rahman (bofh) · 14.0.2.1+1_8
Mk/**ruby.mk: Switch from USE_RUBY=yes to USES=ruby

Switch from Mk/bsd.ruby.mk to Mk/Uses/ruby.mk

Notable changes are.

- Mk/bsd.ruby.mk is moved to Mk/Uses/ruby.mk.
- USE_RUBY=yes is replaced with USES=ruby.
- USE_RUBY_EXTCONF is replaced with USES=ruby:extconf.
- USE_RUBY_RDOC is replaced with USES=ruby:rdoc.
- USE_RUBY_SETUP is replaces with USES=ruby:setup.
- RUBY_NO_BUILD_DEPENDS and RUBY_NO_RUN_DEPENDS are replaced with
  USES=ruby:{build,none,run}.
- RUBY_REQUIRE isn't used anywhere, so removed.
- USES=gem now implies USES=ruby.

This is mainly the work of yasu@ at https://reviews.freebsd.org/D27863

I have just made some cosmetic changes and ran exp-run to test that the
tree is not in a BROKEN state.

Approved by:	portmgr
Differential Revision:	https://reviews.freebsd.org/D37925
18c6e18276
Jan Beich (jbeich) · 14.0.2.1+1_8
devel/icu: update to 72.1

Changes:	https://github.com/unicode-org/icu/releases/tag/release-72-1
Reported by:	GitHub (watch releases)
PR:		266582
Exp-run by:	antoine
dfe25d73e7
Daniel Engberg (diizzy) · 14.0.2.1+1_7
*/*: Update path set in BUILD_DEPENDS for CMake

Commit b23ea4e2d2f51b53d8915fe9fd7b4efbdd575e38 changed its location to
devel/cmake-core

Approved by:	portmgr (blanket)
e942e560c4
Stefan Eßer (se) · 14.0.2.1+1_7
Remove WWW entries moved into port Makefiles

Commit b7f05445c00f has added WWW entries to port Makefiles based on
WWW: lines in pkg-descr files.

This commit removes the WWW: lines of moved-over URLs from these
pkg-descr files.

Approved by:		portmgr (tcberner)
fb16dfecae
Stefan Eßer (se) · 14.0.2.1+1_7
Add WWW entries to port Makefiles

It has been common practice to have one or more URLs at the end of the
ports' pkg-descr files, one per line and prefixed with "WWW:". These
URLs should point at a project website or other relevant resources.

Access to these URLs required processing of the pkg-descr files, and
they have often become stale over time. If more than one such URL was
present in a pkg-descr file, only the first one was tarnsfered into
the port INDEX, but for many ports only the last line did contain the
port specific URL to further information.

There have been several proposals to make a project URL available as
a macro in the ports' Makefiles, over time.

This commit implements such a proposal and moves one of the WWW: entries
of each pkg-descr file into the respective port's Makefile. A heuristic
attempts to identify the most relevant URL in case there is more than
one WWW: entry in some pkg-descr file. URLs that are not moved into the
Makefile are prefixed with "See also:" instead of "WWW:" in the pkg-descr
files in order to preserve them.

There are 1256 ports that had no WWW: entries in pkg-descr files. These
ports will not be touched in this commit.

The portlint port has been adjusted to expect a WWW entry in each port
Makefile, and to flag any remaining "WWW:" lines in pkg-descr files as
deprecated.

Approved by:		portmgr (tcberner)
b7f05445c0
Charlie Li (vishwin) · 14.0.2.1+1_7
textproc/libxml2: bump all LIB_DEPENDS consumers

This is a separate commit to facilitate easier cherry-picking for
quarterly.

PR: 262853, 262940, 262877, 263126
Approved by: fluffy (mentor)
d63665f7cd
Jan Beich (jbeich) · 14.0.2.1+1_6
devel/icu: update to 71.1

Changes:	https://github.com/unicode-org/icu/releases/tag/release-71-1
Reported by:	GitHub (watch releases)
PR:		262654
Exp-run by:	antoine
Approved by:	fluffy
268cee3b02
Matthias Fechner (mfechner) · 14.0.2.1+1_5
textproc/libxml2: bump all dependencies

This should make sure that all dependent ports will pick
up the new version commited with a13ec21cd733f67a9fc0dc00ab45268bdc236246
247c7db751
Mikael Urankar (mikael) · 14.0.2.1+1_4
java/openjfx14: Enable on i386
9a7664c519
Mikael Urankar (mikael) · 14.0.2.1+1_4
java/openjfx14: fix build with non-default CCACHE_DIR

In the build of openjfx14 CCACHE_DIR gets lost leading to build failures e.g.
when building as nobody, so add it into ccwrapper and cxxwrapper.

While here remove redundant ${SETENV} in do-build (${_GRADLE_RUN}
already contains ${SETENV})

PR:		260215
4ddd25225a
Jan Beich (jbeich) · 14.0.2.1+1_4
devel/icu: update to 70.1

Changes:	https://github.com/unicode-org/icu/releases/tag/release-70-1
Reported by:	GitHub (watch releases)
PR:		258794
Exp-run by:	antoine
f34ece3aa6
Kevin Bowling (kbowling) · 14.0.2.1+1_3
graphics/mesa-libs: Bump reverse deps for libglvnd

Per discussion with bapt on helping pkg handle the changing of these
deps and avoiding impossible upgrade senarios.

PR:		246767
Reviewed by:	manu, bapt
Approved by:	x11
Differential Revision:	https://reviews.freebsd.org/D30824
da3162c7c9
Jan Beich (jbeich) · 14.0.2.1+1_2
devel/icu: update to 69.1

Changes:	https://github.com/unicode-org/icu/releases/tag/release-69-1
Reported by:	GitHub (watch releases)
69d24a727d
Mathieu Arnold (mat) · 14.0.2.1+1_1
One more small cleanup, forgotten yesterday. Reported by:	lwhsu
cf118ccf87