CVE and update status of the FreeBSD ports tree3,312 unaddressed CVEs in 679 portsAll times are CET
Port details

www/chromium 156.0.8078.47_1

Google web browser based on WebKit

Port info

Maintainer
chromium@FreeBSD.org
Packages
latest: 156.0.8078.47_1
Upstream
up to date
Last update
to 156.0.8078.47_1 · f573466189
Quarterly
not in the 2026Q4 packages
WWW
https://www.chromium.org/Home
Links
cgit · VuXML · Report wrong data

Install

Package
# pkg install chromium
installs 156.0.8078.47_1 from latest
Port
# cd /usr/ports/www/chromium && make install clean
# make -C /usr/ports/www/chromium config  # change options first
Size
147 MiB download · 518 MiB installed
Depends on
accessibility/at-spi2-core 2.60.4, accessibility/speech-dispatcher 0.12.1_1, audio/alsa-lib 1.2.16.1, audio/alsa-plugins 1.2.12_2, audio/flac 1.5.0,1, audio/opus 1.6.1, audio/sndio 1.10.0_1, audio/speex 1.2.1_1,1, converters/libiconv 1.18_1, devel/dbus 1.16.2_4,1, devel/dbus-glib 0.116, devel/dconf 0.49.0, devel/desktop-file-utils 0.28, devel/gettext-runtime 1.0_1, devel/glib20 2.88.3,2, devel/icu 76.1,1, devel/jsoncpp 1.9.8, devel/libepoll-shim 0.0.20240608, devel/libevent 2.1.13, devel/libffi 3.8.0, devel/libpci 3.15.0, devel/nspr 4.39, devel/re2 20251105, devel/xdg-utils 1.2.1, graphics/cairo 1.18.2,3, graphics/gdk-pixbuf2 2.44.1, graphics/jpeg-turbo 3.1.4.1, graphics/libdrm 2.4.134,1, graphics/libexif 0.6.26, graphics/libglvnd 1.7.0, graphics/mesa-libs 26.2.2_1, graphics/png 1.6.59_1, graphics/wayland 1.26.0, graphics/webp 1.6.0, multimedia/dav1d 1.5.4, multimedia/openh264 2.6.0_1,2, multimedia/pipewire 1.6.9, print/cups 2.4.20, print/freetype2 2.14.3, print/harfbuzz 14.6.0, print/harfbuzz-icu 14.6.0, security/libgcrypt 1.12.4, security/libsecret 0.21.7_2, security/nss 3.131.1, textproc/expat2 2.9.0, textproc/libxml2 2.15.4, textproc/libxslt 1.1.45, x11-fonts/fontconfig 2.18.3,1, x11-fonts/noto-basic 2.0_4, x11-toolkits/gtk30 3.24.52, x11-toolkits/pango 1.57.1, x11/libX11 1.8.14,1, x11/libXScrnSaver 1.2.5, x11/libXcomposite 0.4.7,1, x11/libXcursor 1.2.3, x11/libXdamage 1.1.7, x11/libXext 1.3.7,1, x11/libXfixes 6.0.2, x11/libXi 1.8.4,1, x11/libXrandr 1.5.5, x11/libXrender 0.9.13, x11/libXtst 1.2.6, x11/libxcb 1.17.0, x11/libxkbcommon 1.13.2, x11/libxshmfence 1.3.3
License
BSD3CLAUSE and LGPL21 and MPL11
Options
8 of 15 on in the package: ALSA CODECS CUPS DRIVER KERBEROS PIPEWIRE PULSEAUDIO SNDIO
Show the 7 options that are off
DEBUG HEIMDAL HEIMDAL_BASE LTO MIT TEST WIDEVINE

Packages by version and architecture

latest

FreeBSD versionamd64aarch64i386
FreeBSD 16✗✗–
FreeBSD 15156.0.8078.47_1✗–
FreeBSD 14✗✗✗

quarterly (2026Q4)

FreeBSD versionamd64aarch64i386
FreeBSD 15✗✗–
FreeBSD 14✗✗✗

version as in the ports tree (latest) or the most common one (quarterly) · different version · ✗ not built · – no packages for this platform. Package sets that have not been rebuilt for 60 days are left out.

Unaddressed and VuXML only (0)

No unaddressed CVE and nothing reported by pkg audit for the packaged version 156.0.8078.47_1.

Fixed (656)

Show 656 fixed
VuXML entries whose affected range the packaged version has left, plus CVEs whose record still lists this version although VuXML considers them fixed (usually a backported fix), plus CVEs from the last 90 days that this version is already past (fixed by update).
CVECVSSPublishedDescription
CVE-2026-1133448.82026-10-20VuXML · Use after free in Performance in Google Chrome prior to 156.0.8078.47 allowed a remote attacker to execute arbitrary code inside the sandbox via a crafted HTML page. (Ch…
CVECVSSPublishedDescription
CVE-2026-1133369.62026-10-20Memory corruption in Compositing in Google Chrome prior to 156.0.8078.47 allowed a remote attacker to potentially execute arbitrary code outside the sandbox via a crafte…
CVE-2026-1133429.62026-10-20Memory corruption in Network in Google Chrome prior to 156.0.8078.47 allowed a remote attacker to execute arbitrary code outside the sandbox via a crafted HTML page. (Ch…
CVE-2026-1133289.62026-10-20Improper input validation in Privacy in Google Chrome prior to 156.0.8078.47 allowed a remote attacker to potentially execute arbitrary code outside the sandbox via a cr…
CVE-2026-1133009.62026-10-20Out of bounds write in Forms in Google Chrome prior to 156.0.8078.47 allowed a remote attacker to potentially execute arbitrary code outside the sandbox via a crafted HT…
CVE-2026-1132839.62026-10-20Memory corruption in CredentialProvider in Google Chrome on on Windows prior to 156.0.8078.47 allowed a remote attacker to potentially execute arbitrary code outside the…
CVE-2026-1132639.62026-10-20Use after free in Core in Google Chrome on on Android prior to 156.0.8078.47 allowed a remote attacker to potentially execute arbitrary code outside the sandbox via a cr…
CVE-2026-1132709.62026-10-20Use after free in Internals in Google Chrome prior to 156.0.8078.47 allowed a remote attacker to execute arbitrary code outside the sandbox via a crafted HTML page. (Chr…
CVE-2026-1132619.62026-10-20Use after free in WebAppInstalls in Google Chrome prior to 156.0.8078.47 allowed a remote attacker to potentially execute arbitrary code outside the sandbox via a crafte…
CVE-2026-1132529.62026-10-20Improper input validation in ANGLE in Google Chrome on on Windows prior to 156.0.8078.47 allowed a remote attacker to potentially execute arbitrary code outside the sand…
CVE-2026-1132359.62026-10-20Improper input validation in Passwords in Google Chrome prior to 156.0.8078.47 allowed a remote attacker to potentially execute arbitrary code outside the sandbox via a …
CVE-2026-1132229.62026-10-20Use after free in V8 in Google Chrome prior to 156.0.8078.47 allowed a remote attacker to potentially execute arbitrary code outside the sandbox via a crafted HTML page.…
CVE-2026-1132119.62026-10-20Memory corruption in ServiceWorker in Google Chrome prior to 156.0.8078.47 allowed a remote attacker to potentially execute arbitrary code outside the sandbox via a craf…
CVE-2026-1131869.62026-10-20Memory corruption in DevTools in Google Chrome prior to 156.0.8078.47 allowed a remote attacker to execute arbitrary code outside the sandbox via a crafted HTML page. (C…
CVE-2026-1131899.62026-10-20Use after free in Core in Google Chrome prior to 156.0.8078.47 allowed a remote attacker to execute arbitrary code outside the sandbox via a crafted HTML page. (Chromium…
CVE-2026-1131699.62026-10-20Memory corruption in WebAppInstalls in Google Chrome on on Android prior to 156.0.8078.47 allowed a remote attacker to execute arbitrary code outside the sandbox via a c…
CVE-2026-1131719.62026-10-20Memory corruption in Prompts in Google Chrome on on Android prior to 156.0.8078.47 allowed a remote attacker to potentially execute arbitrary code outside the sandbox vi…
CVE-2026-1131389.62026-10-20Memory corruption in WebAppInstalls in Google Chrome prior to 156.0.8078.47 allowed a remote attacker to potentially execute arbitrary code outside the sandbox via a cra…
CVE-2026-1131269.62026-10-20Memory corruption in PolicyContainer in Google Chrome prior to 156.0.8078.47 allowed a remote attacker to potentially execute arbitrary code outside the sandbox via a cr…
CVE-2026-1131169.62026-10-20Use after free in DevTools in Google Chrome prior to 156.0.8078.47 allowed a remote attacker to potentially execute arbitrary code outside the sandbox via a crafted HTML…
CVE-2026-1130849.62026-10-20Improper input validation in Permissions in Google Chrome prior to 156.0.8078.47 allowed a remote attacker to potentially execute arbitrary code outside the sandbox via …
CVE-2026-1130899.62026-10-20Improper input validation in PrintPreview in Google Chrome prior to 156.0.8078.47 allowed a remote attacker to potentially execute arbitrary code outside the sandbox via…
CVE-2026-1130729.62026-10-20Memory corruption in CSS in Google Chrome prior to 156.0.8078.47 allowed a remote attacker to potentially execute arbitrary code outside the sandbox via a crafted HTML p…
CVE-2026-1130569.62026-10-20Memory corruption in PerformanceAPIs in Google Chrome prior to 156.0.8078.47 allowed a remote attacker to potentially execute arbitrary code outside the sandbox via a cr…
CVE-2026-1130239.62026-10-20Improper input validation in Extensions in Google Chrome prior to 156.0.8078.47 allowed a remote attacker to potentially execute arbitrary code outside the sandbox via a…
CVE-2026-1130149.62026-10-20Use after free in PerformanceAPIs in Google Chrome prior to 156.0.8078.47 allowed a remote attacker to potentially execute arbitrary code outside the sandbox via a craft…
CVE-2026-1130209.62026-10-20Improper input validation in Date in Google Chrome prior to 156.0.8078.47 allowed a remote attacker to potentially execute arbitrary code outside the sandbox via a craft…
CVE-2026-1130079.62026-10-20Memory corruption in Permissions in Google Chrome prior to 156.0.8078.47 allowed a remote attacker to potentially execute arbitrary code outside the sandbox via a crafte…
CVE-2026-1129929.62026-10-20Memory corruption in Canvas in Google Chrome prior to 156.0.8078.47 allowed a remote attacker to potentially execute arbitrary code outside the sandbox via a crafted HTM…
CVE-2026-1130789.62026-10-20Improper input validation in Compositing in Google Chrome prior to 156.0.8078.47 allowed a remote attacker to potentially execute arbitrary code outside the sandbox via …
CVE-2026-1133438.82026-10-20Memory corruption in Sandbox in Google Chrome prior to 156.0.8078.47 allowed a remote attacker to execute arbitrary code inside the sandbox via a crafted HTML page. (Chr…
CVE-2026-1133358.82026-10-20Memory corruption in Extensions in Google Chrome prior to 156.0.8078.47 allowed a remote attacker to execute arbitrary code inside the sandbox via a crafted HTML page. (…
CVE-2026-1133378.82026-10-20Memory corruption in Scroll in Google Chrome prior to 156.0.8078.47 allowed a remote attacker to execute arbitrary code inside the sandbox via a crafted HTML page. (Chro…
CVE-2026-1133388.82026-10-20Use after free in Turbolev in Google Chrome prior to 156.0.8078.47 allowed a remote attacker to execute arbitrary code inside the sandbox via a crafted HTML page. (Chrom…
CVE-2026-1133398.82026-10-20Use after free in SVG in Google Chrome prior to 156.0.8078.47 allowed a remote attacker to execute arbitrary code inside the sandbox via a crafted HTML page. (Chromium s…
CVE-2026-1133278.82026-10-20Use after free in Chromecast in Google Chrome prior to 156.0.8078.47 allowed a remote attacker to execute arbitrary code inside the sandbox via a crafted HTML page. (Chr…
CVE-2026-1133308.82026-10-20Memory corruption in CustomTabs in Google Chrome on on Android prior to 156.0.8078.47 allowed a remote attacker to potentially execute arbitrary code inside the sandbox …
CVE-2026-1133318.82026-10-20Memory corruption in Controls in Google Chrome prior to 156.0.8078.47 allowed a remote attacker to potentially execute arbitrary code inside the sandbox via a crafted HT…
CVE-2026-1133328.82026-10-20Memory corruption in GPU in Google Chrome prior to 156.0.8078.47 allowed a remote attacker to execute arbitrary code inside the sandbox via a crafted HTML page. (Chromiu…
CVE-2026-1133348.82026-10-20Improper input validation in ANGLE in Google Chrome on on Windows prior to 156.0.8078.47 allowed a remote attacker to potentially execute arbitrary code inside the sandb…
CVE-2026-1133178.82026-10-20Memory corruption in Accessibility in Google Chrome on on Mac prior to 156.0.8078.47 allowed a remote attacker to potentially execute arbitrary code inside the sandbox v…
CVE-2026-1133188.82026-10-20Memory corruption in ServiceWorker in Google Chrome prior to 156.0.8078.47 allowed a remote attacker to execute arbitrary code inside the sandbox via a crafted HTML page…
CVE-2026-1133198.82026-10-20Use after free in Accessibility in Google Chrome prior to 156.0.8078.47 allowed a remote attacker to execute arbitrary code inside the sandbox via a crafted HTML page. (…
CVE-2026-1133208.82026-10-20Memory corruption in Navigation in Google Chrome on on iOS prior to 156.0.8078.47 allowed a remote attacker to potentially execute arbitrary code inside the sandbox via …
CVE-2026-1133218.82026-10-20Use after free in Extensions in Google Chrome prior to 156.0.8078.47 allowed a remote attacker to execute arbitrary code inside the sandbox via a crafted HTML page. (Chr…
CVE-2026-1133238.82026-10-20Use after free in Chrome for iOS in Google Chrome on on iOS prior to 156.0.8078.47 allowed a remote attacker to potentially execute arbitrary code inside the sandbox via…
CVE-2026-1133248.82026-10-20Use after free in GPU in Google Chrome prior to 156.0.8078.47 allowed a remote attacker to execute arbitrary code inside the sandbox via a crafted HTML page. (Chromium s…
CVE-2026-1133088.82026-10-20Use after free in Core in Google Chrome prior to 156.0.8078.47 allowed a remote attacker to execute arbitrary code inside the sandbox via a crafted HTML page. (Chromium …
CVE-2026-1133118.82026-10-20Use after free in ServiceWorker in Google Chrome prior to 156.0.8078.47 allowed a remote attacker to execute arbitrary code inside the sandbox via a crafted HTML page. (…
CVE-2026-1133128.82026-10-20Memory corruption in Autofill in Google Chrome on on Mac prior to 156.0.8078.47 allowed a remote attacker to potentially execute arbitrary code inside the sandbox via a …
CVE-2026-1133138.82026-10-20Memory corruption in DevTools in Google Chrome prior to 156.0.8078.47 allowed a remote attacker to potentially execute arbitrary code inside the sandbox via a crafted HT…
CVE-2026-1133148.82026-10-20Use after free in Media in Google Chrome prior to 156.0.8078.47 allowed a remote attacker to execute arbitrary code inside the sandbox via a crafted HTML page. (Chromium…
CVE-2026-1133158.82026-10-20Memory corruption in ANGLE in Google Chrome prior to 156.0.8078.47 allowed a remote attacker to potentially execute arbitrary code inside the sandbox via a crafted HTML …
CVE-2026-1133168.82026-10-20Improper input validation in Views in Google Chrome prior to 156.0.8078.47 allowed a remote attacker to execute arbitrary code inside the sandbox via a crafted HTML page…
CVE-2026-1132998.82026-10-20Memory corruption in WebProtect in Google Chrome prior to 156.0.8078.47 allowed a remote attacker to potentially execute arbitrary code inside the sandbox via a crafted …
CVE-2026-1133018.82026-10-20Memory corruption in WebAppInstalls in Google Chrome prior to 156.0.8078.47 allowed a remote attacker to potentially execute arbitrary code inside the sandbox via a craf…
CVE-2026-1133028.82026-10-20Use after free in Extensions in Google Chrome prior to 156.0.8078.47 allowed a remote attacker to execute arbitrary code inside the sandbox via a crafted HTML page. (Chr…
CVE-2026-1133038.82026-10-20Memory corruption in WebRTC in Google Chrome prior to 156.0.8078.47 allowed a remote attacker to potentially execute arbitrary code inside the sandbox via a crafted HTML…
CVE-2026-1133058.82026-10-20Use after free in Privacy in Google Chrome prior to 156.0.8078.47 allowed a remote attacker to execute arbitrary code inside the sandbox via a crafted HTML page. (Chromi…
CVE-2026-1133068.82026-10-20Improper input validation in Network in Google Chrome prior to 156.0.8078.47 allowed a remote attacker to potentially execute arbitrary code inside the sandbox via a cra…
CVE-2026-1133078.82026-10-20Memory corruption in Extensions in Google Chrome prior to 156.0.8078.47 allowed a remote attacker to execute arbitrary code inside the sandbox via a crafted HTML page. (…
CVE-2026-1132908.82026-10-20Use after free in Input in Google Chrome prior to 156.0.8078.47 allowed a remote attacker to potentially execute arbitrary code inside the sandbox via a crafted HTML pag…
CVE-2026-1132918.82026-10-20Memory corruption in FullScreen in Google Chrome prior to 156.0.8078.47 allowed a remote attacker to potentially execute arbitrary code inside the sandbox via a crafted …
CVE-2026-1132928.82026-10-20Improper input validation in Omnibox in Google Chrome on on Android prior to 156.0.8078.47 allowed a remote attacker to potentially execute arbitrary code inside the san…
CVE-2026-1132938.82026-10-20Use after free in ANGLE in Google Chrome on on Windows prior to 156.0.8078.47 allowed a remote attacker to execute arbitrary code inside the sandbox via a crafted HTML p…
CVE-2026-1132948.82026-10-20Improper input validation in Loader in Google Chrome prior to 156.0.8078.47 allowed a remote attacker to potentially execute arbitrary code inside the sandbox via a craf…
CVE-2026-1132988.82026-10-20Use after free in Transactions Platform in Google Chrome prior to 156.0.8078.47 allowed a remote attacker to execute arbitrary code inside the sandbox via a crafted HTML…
CVE-2026-1132818.82026-10-20Memory corruption in SiteIsolation in Google Chrome prior to 156.0.8078.47 allowed a remote attacker to potentially execute arbitrary code inside the sandbox via a craft…
CVE-2026-1132828.82026-10-20Use after free in Views in Google Chrome on on Mac prior to 156.0.8078.47 allowed a remote attacker to potentially execute arbitrary code inside the sandbox via a crafte…
CVE-2026-1132848.82026-10-20Memory corruption in XML in Google Chrome prior to 156.0.8078.47 allowed a remote attacker to potentially execute arbitrary code inside the sandbox via a crafted HTML pa…
CVE-2026-1132858.82026-10-20Memory corruption in ANGLE in Google Chrome on on Windows prior to 156.0.8078.47 allowed a remote attacker to execute arbitrary code inside the sandbox via a crafted HTM…
CVE-2026-1132868.82026-10-20Memory corruption in Google Lens in Google Chrome prior to 156.0.8078.47 allowed a remote attacker to execute arbitrary code inside the sandbox via a crafted HTML page. …
CVE-2026-1132878.82026-10-20Use after free in Prompts in Google Chrome prior to 156.0.8078.47 allowed a remote attacker to execute arbitrary code inside the sandbox via a crafted HTML page. (Chromi…
CVE-2026-1132888.82026-10-20Memory corruption in Core in Google Chrome prior to 156.0.8078.47 allowed a remote attacker to execute arbitrary code inside the sandbox via a crafted HTML page. (Chromi…
CVE-2026-1132898.82026-10-20Improper input validation in PerformanceAPIs in Google Chrome prior to 156.0.8078.47 allowed a remote attacker to potentially execute arbitrary code inside the sandbox v…
CVE-2026-1132728.82026-10-20Memory corruption in Extensions in Google Chrome prior to 156.0.8078.47 allowed a remote attacker to potentially execute arbitrary code inside the sandbox via a crafted …
CVE-2026-1132738.82026-10-20Memory corruption in ANGLE in Google Chrome prior to 156.0.8078.47 allowed a remote attacker to execute arbitrary code inside the sandbox via a crafted HTML page. (Chrom…
CVE-2026-1132748.82026-10-20Use after free in ReadingMode in Google Chrome prior to 156.0.8078.47 allowed a remote attacker to execute arbitrary code inside the sandbox via a crafted HTML page. (Ch…
CVE-2026-1132758.82026-10-20Use after free in API in Google Chrome prior to 156.0.8078.47 allowed a remote attacker to execute arbitrary code inside the sandbox via a crafted HTML page. (Chromium s…
CVE-2026-1132768.82026-10-20Memory corruption in Passwords in Google Chrome on on Android prior to 156.0.8078.47 allowed a remote attacker to potentially execute arbitrary code inside the sandbox v…
CVE-2026-1132788.82026-10-20Use after free in Extensions in Google Chrome prior to 156.0.8078.47 allowed a remote attacker to execute arbitrary code inside the sandbox via a crafted HTML page. (Chr…
CVE-2026-1132798.82026-10-20Memory corruption in Accessibility in Google Chrome prior to 156.0.8078.47 allowed a remote attacker to potentially execute arbitrary code inside the sandbox via a craft…
CVE-2026-1132808.82026-10-20Memory corruption in Paint in Google Chrome prior to 156.0.8078.47 allowed a remote attacker to execute arbitrary code inside the sandbox via a crafted HTML page. (Chrom…
CVE-2026-1132648.82026-10-20Improper input validation in Extensions in Google Chrome prior to 156.0.8078.47 allowed a remote attacker to potentially execute arbitrary code inside the sandbox via a …
CVE-2026-1132658.82026-10-20Memory corruption in BFCache in Google Chrome prior to 156.0.8078.47 allowed a remote attacker to potentially execute arbitrary code inside the sandbox via a crafted HTM…
CVE-2026-1132668.82026-10-20Memory corruption in ANGLE in Google Chrome on on Android prior to 156.0.8078.47 allowed a remote attacker to potentially execute arbitrary code inside the sandbox via a…
CVE-2026-1132678.82026-10-20Memory corruption in Video in Google Chrome prior to 156.0.8078.47 allowed a remote attacker to potentially execute arbitrary code inside the sandbox via a crafted HTML …
CVE-2026-1132688.82026-10-20Memory corruption in Navigation in Google Chrome on on iOS prior to 156.0.8078.47 allowed a remote attacker to execute arbitrary code inside the sandbox via a crafted HT…
CVE-2026-1132698.82026-10-20Memory corruption in BrowserTag in Google Chrome prior to 156.0.8078.47 allowed a remote attacker to potentially execute arbitrary code inside the sandbox via a crafted …
CVE-2026-1132718.82026-10-20Use after free in Accessibility in Google Chrome prior to 156.0.8078.47 allowed a remote attacker to execute arbitrary code inside the sandbox via a crafted HTML page. (…
CVE-2026-1132548.82026-10-20Memory corruption in DevTools in Google Chrome prior to 156.0.8078.47 allowed a remote attacker to potentially execute arbitrary code inside the sandbox via a crafted HT…
CVE-2026-1132558.82026-10-20Use after free in CustomTabs in Google Chrome on on Android prior to 156.0.8078.47 allowed a remote attacker to execute arbitrary code inside the sandbox via a crafted H…
CVE-2026-1132568.82026-10-20Use after free in Permissions in Google Chrome prior to 156.0.8078.47 allowed a remote attacker to execute arbitrary code inside the sandbox via a crafted HTML page. (Ch…
CVE-2026-1132578.82026-10-20Memory corruption in Media in Google Chrome prior to 156.0.8078.47 allowed a remote attacker to potentially execute arbitrary code inside the sandbox via a crafted HTML …
CVE-2026-1132588.82026-10-20Memory corruption in Chromoting in Google Chrome prior to 156.0.8078.47 allowed a remote attacker to potentially execute arbitrary code inside the sandbox via a crafted …
CVE-2026-1132598.82026-10-20Use after free in Frames in Google Chrome prior to 156.0.8078.47 allowed a remote attacker to execute arbitrary code inside the sandbox via a crafted HTML page. (Chromiu…
CVE-2026-1132608.82026-10-20Memory corruption in Core in Google Chrome prior to 156.0.8078.47 allowed a remote attacker to potentially execute arbitrary code inside the sandbox via a crafted HTML p…
CVE-2026-1132628.82026-10-20Use after free in Extensions in Google Chrome prior to 156.0.8078.47 allowed a remote attacker to potentially execute arbitrary code inside the sandbox via a crafted HTM…
CVE-2026-1132458.82026-10-20Memory corruption in DevTools in Google Chrome prior to 156.0.8078.47 allowed a remote attacker to execute arbitrary code inside the sandbox via a crafted HTML page. (Ch…
CVE-2026-1132478.82026-10-20Memory corruption in DevTools in Google Chrome prior to 156.0.8078.47 allowed a remote attacker to execute arbitrary code inside the sandbox via a crafted HTML page. (Ch…
CVE-2026-1132488.82026-10-20Memory corruption in FileSystem in Google Chrome prior to 156.0.8078.47 allowed a remote attacker to potentially execute arbitrary code inside the sandbox via a crafted …
CVE-2026-1132498.82026-10-20Improper input validation in Mobile in Google Chrome on on iOS prior to 156.0.8078.47 allowed a remote attacker to potentially execute arbitrary code inside the sandbox …
CVE-2026-1132508.82026-10-20Use after free in ANGLE in Google Chrome prior to 156.0.8078.47 allowed a remote attacker to potentially execute arbitrary code inside the sandbox via a crafted HTML pag…
CVE-2026-1132518.82026-10-20Use after free in PDF in Google Chrome prior to 156.0.8078.47 allowed a remote attacker to execute arbitrary code inside the sandbox via a crafted HTML page. (Chromium s…
CVE-2026-1132538.82026-10-20Use after free in Canvas in Google Chrome prior to 156.0.8078.47 allowed a remote attacker to execute arbitrary code inside the sandbox via a crafted HTML page. (Chromiu…
CVE-2026-1132388.82026-10-20Memory corruption in CustomTabs in Google Chrome on on Android prior to 156.0.8078.47 allowed a remote attacker to potentially execute arbitrary code inside the sandbox …
CVE-2026-1132398.82026-10-20Range error in SiteIsolation in Google Chrome on on Android prior to 156.0.8078.47 allowed a remote attacker to execute arbitrary code inside the sandbox via a crafted H…
CVE-2026-1132408.82026-10-20Use after free in Chromecast in Google Chrome prior to 156.0.8078.47 allowed a remote attacker to potentially execute arbitrary code inside the sandbox via a crafted HTM…
CVE-2026-1132418.82026-10-20Memory corruption in Toolbar in Google Chrome on on Android prior to 156.0.8078.47 allowed a remote attacker to potentially execute arbitrary code inside the sandbox via…
CVE-2026-1132428.82026-10-20Memory corruption in ANGLE in Google Chrome on on Windows prior to 156.0.8078.47 allowed a remote attacker to execute arbitrary code inside the sandbox via a crafted HTM…
CVE-2026-1132438.82026-10-20Memory corruption in DOM in Google Chrome prior to 156.0.8078.47 allowed a remote attacker to potentially execute arbitrary code inside the sandbox via a crafted HTML pa…
CVE-2026-1132448.82026-10-20Improper input validation in UI in Google Chrome prior to 156.0.8078.47 allowed a remote attacker to potentially execute arbitrary code inside the sandbox via a crafted …
CVE-2026-1132288.82026-10-20Use after free in Network in Google Chrome prior to 156.0.8078.47 allowed a remote attacker to execute arbitrary code inside the sandbox via a crafted HTML page. (Chromi…
CVE-2026-1132298.82026-10-20Use after free in Loader in Google Chrome prior to 156.0.8078.47 allowed a remote attacker to execute arbitrary code inside the sandbox via a crafted HTML page. (Chromiu…
CVE-2026-1132308.82026-10-20Improper input validation in Browser in Google Chrome prior to 156.0.8078.47 allowed a remote attacker to potentially execute arbitrary code inside the sandbox via a cra…
CVE-2026-1132318.82026-10-20Improper input validation in Extensions in Google Chrome prior to 156.0.8078.47 allowed a remote attacker to potentially execute arbitrary code inside the sandbox via a …
CVE-2026-1132328.82026-10-20Memory corruption in Search in Google Chrome prior to 156.0.8078.47 allowed a remote attacker to potentially execute arbitrary code inside the sandbox via a crafted HTML…
CVE-2026-1132338.82026-10-20Out of bounds read in Core in Google Chrome on on Android prior to 156.0.8078.47 allowed a remote attacker to potentially execute arbitrary code inside the sandbox via a…
CVE-2026-1132348.82026-10-20Memory corruption in ANGLE in Google Chrome prior to 156.0.8078.47 allowed a remote attacker to potentially execute arbitrary code inside the sandbox via a crafted HTML …
CVE-2026-1132368.82026-10-20Use after free in Navigation in Google Chrome on on iOS prior to 156.0.8078.47 allowed a remote attacker to execute arbitrary code inside the sandbox via a crafted HTML …
CVE-2026-1132188.82026-10-20Use after free in DataTransfer in Google Chrome prior to 156.0.8078.47 allowed a remote attacker to execute arbitrary code inside the sandbox via a crafted HTML page. (C…
CVE-2026-1132198.82026-10-20Memory corruption in Contacts in Google Chrome prior to 156.0.8078.47 allowed a remote attacker to execute arbitrary code inside the sandbox via a crafted HTML page. (Ch…
CVE-2026-1132218.82026-10-20Use after free in Google Lens in Google Chrome prior to 156.0.8078.47 allowed a remote attacker to execute arbitrary code inside the sandbox via a crafted HTML page. (Ch…
CVE-2026-1132268.82026-10-20Memory corruption in Model in Google Chrome prior to 156.0.8078.47 allowed a remote attacker to execute arbitrary code inside the sandbox via a crafted HTML page. (Chrom…
CVE-2026-1132278.82026-10-20Use after free in Editing in Google Chrome prior to 156.0.8078.47 allowed a remote attacker to execute arbitrary code inside the sandbox via a crafted HTML page. (Chromi…
CVE-2026-1132108.82026-10-20Use after free in ANGLE in Google Chrome on on Windows prior to 156.0.8078.47 allowed a remote attacker to execute arbitrary code inside the sandbox via a crafted HTML p…
CVE-2026-1132138.82026-10-20Memory corruption in DevTools in Google Chrome prior to 156.0.8078.47 allowed a remote attacker to execute arbitrary code inside the sandbox via a crafted HTML page. (Ch…
CVE-2026-1132148.82026-10-20Improper input validation in FullScreen in Google Chrome prior to 156.0.8078.47 allowed a remote attacker to potentially execute arbitrary code inside the sandbox via a …
CVE-2026-1132158.82026-10-20Use after free in Extensions in Google Chrome prior to 156.0.8078.47 allowed a remote attacker to execute arbitrary code inside the sandbox via a crafted HTML page. (Chr…
CVE-2026-1132168.82026-10-20Use after free in Navigation in Google Chrome prior to 156.0.8078.47 allowed a remote attacker to execute arbitrary code inside the sandbox via a crafted HTML page. (Chr…
CVE-2026-1132178.82026-10-20Use after free in WebAppInstalls in Google Chrome on on Android prior to 156.0.8078.47 allowed a remote attacker to execute arbitrary code inside the sandbox via a craft…
CVE-2026-1132008.82026-10-20Use after free in ANGLE in Google Chrome prior to 156.0.8078.47 allowed a remote attacker to execute arbitrary code inside the sandbox via a crafted HTML page. (Chromium…
CVE-2026-1132028.82026-10-20Use after free in BrowserTag in Google Chrome prior to 156.0.8078.47 allowed a remote attacker to execute arbitrary code inside the sandbox via a crafted HTML page. (Chr…
CVE-2026-1132038.82026-10-20Use after free in CSS in Google Chrome prior to 156.0.8078.47 allowed a remote attacker to potentially execute arbitrary code inside the sandbox via a crafted HTML page.…
CVE-2026-1132048.82026-10-20Use after free in TrustedWebActivities in Google Chrome on on Android prior to 156.0.8078.47 allowed a remote attacker to potentially execute arbitrary code inside the s…
CVE-2026-1132058.82026-10-20Use after free in Variations in Google Chrome prior to 156.0.8078.47 allowed a remote attacker to execute arbitrary code inside the sandbox via a crafted HTML page. (Chr…
CVE-2026-1132068.82026-10-20Memory corruption in Omnibox in Google Chrome prior to 156.0.8078.47 allowed a remote attacker to execute arbitrary code inside the sandbox via a crafted HTML page. (Chr…
CVE-2026-1132078.82026-10-20Use after free in SiteIsolation in Google Chrome on on Android prior to 156.0.8078.47 allowed a remote attacker to execute arbitrary code inside the sandbox via a crafte…
CVE-2026-1132088.82026-10-20Use after free in ContextualSearch in Google Chrome prior to 156.0.8078.47 allowed a remote attacker to execute arbitrary code inside the sandbox via a crafted HTML page…
CVE-2026-1131928.82026-10-20Memory corruption in V8 in Google Chrome prior to 156.0.8078.47 allowed a remote attacker to execute arbitrary code inside the sandbox via a crafted HTML page. (Chromium…
CVE-2026-1131948.82026-10-20Memory corruption in Core in Google Chrome prior to 156.0.8078.47 allowed a remote attacker to execute arbitrary code inside the sandbox via a crafted HTML page. (Chromi…
CVE-2026-1131958.82026-10-20Improper input validation in Downloads in Google Chrome prior to 156.0.8078.47 allowed a remote attacker to potentially execute arbitrary code inside the sandbox via a c…
CVE-2026-1131978.82026-10-20Use after free in Forms in Google Chrome prior to 156.0.8078.47 allowed a remote attacker to execute arbitrary code inside the sandbox via a crafted HTML page. (Chromium…
CVE-2026-1131988.82026-10-20Use after free in Extensions in Google Chrome prior to 156.0.8078.47 allowed a remote attacker to execute arbitrary code inside the sandbox via a crafted HTML page. (Chr…
CVE-2026-1131838.82026-10-20Memory corruption in FedCM in Google Chrome prior to 156.0.8078.47 allowed a remote attacker to potentially execute arbitrary code inside the sandbox via a crafted HTML …
CVE-2026-1131848.82026-10-20Memory corruption in Scheduling in Google Chrome prior to 156.0.8078.47 allowed a remote attacker to potentially execute arbitrary code inside the sandbox via a crafted …
CVE-2026-1131858.82026-10-20Memory corruption in Extensions in Google Chrome prior to 156.0.8078.47 allowed a remote attacker to execute arbitrary code inside the sandbox via a crafted HTML page. (…
CVE-2026-1131878.82026-10-20Use after free in DOM in Google Chrome prior to 156.0.8078.47 allowed a remote attacker to execute arbitrary code inside the sandbox via a crafted HTML page. (Chromium s…
CVE-2026-1131888.82026-10-20Memory corruption in GPU in Google Chrome prior to 156.0.8078.47 allowed a remote attacker to potentially execute arbitrary code inside the sandbox via a crafted HTML pa…
CVE-2026-1131908.82026-10-20Use after free in ServiceWorker in Google Chrome prior to 156.0.8078.47 allowed a remote attacker to potentially execute arbitrary code inside the sandbox via a crafted …
CVE-2026-1131918.82026-10-20Use after free in Internals in Google Chrome on on Mac prior to 156.0.8078.47 allowed a remote attacker to execute arbitrary code inside the sandbox via a crafted HTML p…
CVE-2026-1131748.82026-10-20Use after free in Extensions in Google Chrome prior to 156.0.8078.47 allowed a remote attacker to execute arbitrary code inside the sandbox via a crafted HTML page. (Chr…
CVE-2026-1131758.82026-10-20Improper input validation in FileSystem in Google Chrome prior to 156.0.8078.47 allowed a remote attacker to execute arbitrary code inside the sandbox via a crafted HTML…
CVE-2026-1131768.82026-10-20Memory corruption in Omnibox in Google Chrome prior to 156.0.8078.47 allowed a remote attacker to potentially execute arbitrary code inside the sandbox via a crafted HTM…
CVE-2026-1131778.82026-10-20Use after free in FileSystem in Google Chrome prior to 156.0.8078.47 allowed a remote attacker to execute arbitrary code inside the sandbox via a crafted HTML page. (Chr…
CVE-2026-1131798.82026-10-20Use after free in Paint in Google Chrome prior to 156.0.8078.47 allowed a remote attacker to execute arbitrary code inside the sandbox via a crafted HTML page. (Chromium…
CVE-2026-1131818.82026-10-20Use after free in Navigation in Google Chrome prior to 156.0.8078.47 allowed a remote attacker to execute arbitrary code inside the sandbox via a crafted HTML page. (Chr…
CVE-2026-1131828.82026-10-20Memory corruption in Passwords in Google Chrome prior to 156.0.8078.47 allowed a remote attacker to execute arbitrary code inside the sandbox via a crafted HTML page. (C…
CVE-2026-1131648.82026-10-20Memory corruption in Voice in Google Chrome on on Android prior to 156.0.8078.47 allowed a remote attacker to execute arbitrary code inside the sandbox via a crafted HTM…
CVE-2026-1131658.82026-10-20Use after free in Core in Google Chrome on on Mac prior to 156.0.8078.47 allowed a remote attacker to execute arbitrary code inside the sandbox via a crafted HTML page. …
CVE-2026-1131668.82026-10-20Memory corruption in History in Google Chrome on on Android prior to 156.0.8078.47 allowed a remote attacker to execute arbitrary code inside the sandbox via a crafted H…
CVE-2026-1131678.82026-10-20Memory corruption in Network in Google Chrome prior to 156.0.8078.47 allowed a remote attacker to potentially execute arbitrary code inside the sandbox via a crafted HTM…
CVE-2026-1131688.82026-10-20Use after free in Permissions in Google Chrome prior to 156.0.8078.47 allowed a remote attacker to execute arbitrary code inside the sandbox via a crafted HTML page. (Ch…
CVE-2026-1131728.82026-10-20Memory corruption in ServiceWorker in Google Chrome prior to 156.0.8078.47 allowed a remote attacker to potentially execute arbitrary code inside the sandbox via a craft…
CVE-2026-1131738.82026-10-20Improper input validation in UI in Google Chrome on on Android prior to 156.0.8078.47 allowed a remote attacker to potentially execute arbitrary code inside the sandbox …
CVE-2026-1131558.82026-10-20Use after free in Glic in Google Chrome prior to 156.0.8078.47 allowed a remote attacker to execute arbitrary code inside the sandbox via a crafted HTML page. (Chromium …
CVE-2026-1131568.82026-10-20Use after free in Messages in Google Chrome on on Android prior to 156.0.8078.47 allowed a remote attacker to execute arbitrary code inside the sandbox via a crafted HTM…
CVE-2026-1131588.82026-10-20Use after free in Streaming in Google Chrome prior to 156.0.8078.47 allowed a remote attacker to execute arbitrary code inside the sandbox via a crafted HTML page. (Chro…
CVE-2026-1131608.82026-10-20Use after free in Turbolev in Google Chrome prior to 156.0.8078.47 allowed a remote attacker to execute arbitrary code inside the sandbox via a crafted HTML page. (Chrom…
CVE-2026-1131618.82026-10-20Use after free in WebRTC in Google Chrome prior to 156.0.8078.47 allowed a remote attacker to execute arbitrary code inside the sandbox via a crafted HTML page. (Chromiu…
CVE-2026-1131628.82026-10-20Improper input validation in Actor in Google Chrome prior to 156.0.8078.47 allowed a remote attacker to potentially execute arbitrary code inside the sandbox via a craft…
CVE-2026-1131638.82026-10-20Use after free in WebGL in Google Chrome on on Android prior to 156.0.8078.47 allowed a remote attacker to execute arbitrary code inside the sandbox via a crafted HTML p…
CVE-2026-1131478.82026-10-20Improper input validation in WebShare in Google Chrome prior to 156.0.8078.47 allowed a remote attacker to potentially execute arbitrary code inside the sandbox via a cr…
CVE-2026-1131488.82026-10-20Memory corruption in WebUI in Google Chrome prior to 156.0.8078.47 allowed a remote attacker to potentially execute arbitrary code inside the sandbox via a crafted HTML …
CVE-2026-1131498.82026-10-20Memory corruption in FullScreen in Google Chrome prior to 156.0.8078.47 allowed a remote attacker to execute arbitrary code inside the sandbox via a crafted HTML page. (…
CVE-2026-1131508.82026-10-20Memory corruption in Bindings in Google Chrome prior to 156.0.8078.47 allowed a remote attacker to potentially execute arbitrary code inside the sandbox via a crafted HT…
CVE-2026-1131528.82026-10-20Memory corruption in SignIn in Google Chrome prior to 156.0.8078.47 allowed a remote attacker to potentially execute arbitrary code inside the sandbox via a crafted HTML…
CVE-2026-1131538.82026-10-20Memory corruption in SiteIsolation in Google Chrome prior to 156.0.8078.47 allowed a remote attacker to potentially execute arbitrary code inside the sandbox via a craft…
CVE-2026-1131548.82026-10-20Memory corruption in Canvas in Google Chrome prior to 156.0.8078.47 allowed a remote attacker to potentially execute arbitrary code inside the sandbox via a crafted HTML…
CVE-2026-1131408.82026-10-20Use after free in ANGLE in Google Chrome prior to 156.0.8078.47 allowed a remote attacker to execute arbitrary code inside the sandbox via a crafted HTML page. (Chromium…
CVE-2026-1131418.82026-10-20Use after free in Transactions Platform in Google Chrome prior to 156.0.8078.47 allowed a remote attacker to execute arbitrary code inside the sandbox via a crafted HTML…
CVE-2026-1131438.82026-10-20Memory corruption in ANGLE in Google Chrome prior to 156.0.8078.47 allowed a remote attacker to read memory via a crafted HTML page. (Chromium security severity: Medium)
CVE-2026-1131458.82026-10-20Memory corruption in Messages in Google Chrome on on Android prior to 156.0.8078.47 allowed a remote attacker to potentially execute arbitrary code inside the sandbox vi…
CVE-2026-1131468.82026-10-20Memory corruption in PerformanceAPIs in Google Chrome prior to 156.0.8078.47 allowed a remote attacker to potentially execute arbitrary code inside the sandbox via a cra…
CVE-2026-1131308.82026-10-20Use after free in Actor in Google Chrome prior to 156.0.8078.47 allowed a remote attacker to execute arbitrary code inside the sandbox via a crafted HTML page. (Chromium…
CVE-2026-1131318.82026-10-20Memory corruption in Bluetooth in Google Chrome prior to 156.0.8078.47 allowed a remote attacker to execute arbitrary code inside the sandbox via a crafted HTML page. (C…
CVE-2026-1131328.82026-10-20Memory corruption in DevTools in Google Chrome prior to 156.0.8078.47 allowed a remote attacker to potentially execute arbitrary code inside the sandbox via a crafted HT…
CVE-2026-1131338.82026-10-20Memory corruption in PlatformIntegration in Google Chrome prior to 156.0.8078.47 allowed a remote attacker to execute arbitrary code inside the sandbox via a crafted HTM…
CVE-2026-1131348.82026-10-20Memory corruption in ANGLE in Google Chrome on on Windows prior to 156.0.8078.47 allowed a remote attacker to execute arbitrary code inside the sandbox via a crafted HTM…
CVE-2026-1131358.82026-10-20Memory corruption in PictureInPicture in Google Chrome prior to 156.0.8078.47 allowed a remote attacker to potentially execute arbitrary code inside the sandbox via a cr…
CVE-2026-1131368.82026-10-20Memory corruption in DevTools in Google Chrome prior to 156.0.8078.47 allowed a remote attacker to execute arbitrary code inside the sandbox via a crafted HTML page. (Ch…
CVE-2026-1131378.82026-10-20Memory corruption in Extensions in Google Chrome prior to 156.0.8078.47 allowed a remote attacker to potentially read memory inside the sandbox via a crafted HTML page. …
CVE-2026-1131198.82026-10-20Use after free in Network in Google Chrome on on Windows prior to 156.0.8078.47 allowed a remote attacker to execute arbitrary code inside the sandbox via a crafted HTML…
CVE-2026-1131208.82026-10-20Improper input validation in Media in Google Chrome prior to 156.0.8078.47 allowed a remote attacker to potentially execute arbitrary code inside the sandbox via a craft…
CVE-2026-1131218.82026-10-20Memory corruption in ContextMenu in Google Chrome on on Android prior to 156.0.8078.47 allowed a remote attacker to potentially execute arbitrary code inside the sandbox…
CVE-2026-1131238.82026-10-20Use after free in GPU in Google Chrome prior to 156.0.8078.47 allowed a remote attacker to execute arbitrary code inside the sandbox via a crafted HTML page. (Chromium s…
CVE-2026-1131248.82026-10-20Memory corruption in DataTransfer in Google Chrome prior to 156.0.8078.47 allowed a remote attacker to potentially execute arbitrary code inside the sandbox via a crafte…
CVE-2026-1131258.82026-10-20Memory corruption in DevTools in Google Chrome prior to 156.0.8078.47 allowed a remote attacker to execute arbitrary code inside the sandbox via a crafted HTML page. (Ch…
CVE-2026-1131278.82026-10-20Memory corruption in Browser in Google Chrome prior to 156.0.8078.47 allowed a remote attacker to potentially execute arbitrary code inside the sandbox via a crafted HTM…
CVE-2026-1131288.82026-10-20Missing authorization in Animation in Google Chrome prior to 156.0.8078.47 allowed a remote attacker to bypass web origin policy via a crafted HTML page. (Chromium secur…
CVE-2026-1131118.82026-10-20Use after free in Compositing in Google Chrome prior to 156.0.8078.47 allowed a remote attacker to execute arbitrary code inside the sandbox via a crafted HTML page. (Ch…
CVE-2026-1131128.82026-10-20Use after free in Extensions in Google Chrome prior to 156.0.8078.47 allowed a remote attacker to execute arbitrary code inside the sandbox via a crafted HTML page. (Chr…
CVE-2026-1131138.82026-10-20Use after free in Extensions in Google Chrome prior to 156.0.8078.47 allowed a remote attacker to execute arbitrary code inside the sandbox via a crafted HTML page. (Chr…
CVE-2026-1131148.82026-10-20Use after free in SignIn in Google Chrome prior to 156.0.8078.47 allowed a remote attacker to execute arbitrary code inside the sandbox via a crafted HTML page. (Chromiu…
CVE-2026-1131158.82026-10-20Use after free in Transactions Platform in Google Chrome prior to 156.0.8078.47 allowed a remote attacker to execute arbitrary code inside the sandbox via a crafted HTML…
CVE-2026-1131178.82026-10-20Improper input validation in ANGLE in Google Chrome on on Mac prior to 156.0.8078.47 allowed a remote attacker to potentially execute arbitrary code inside the sandbox v…
CVE-2026-1131188.82026-10-20Memory corruption in Extensions in Google Chrome prior to 156.0.8078.47 allowed a remote attacker to execute arbitrary code inside the sandbox via a crafted HTML page. (…
CVE-2026-1131038.82026-10-20Use after free in WebProtect in Google Chrome prior to 156.0.8078.47 allowed a remote attacker to execute arbitrary code inside the sandbox via a crafted HTML page. (Chr…
CVE-2026-1131048.82026-10-20Memory corruption in Frames in Google Chrome prior to 156.0.8078.47 allowed a remote attacker to potentially execute arbitrary code inside the sandbox via a crafted HTML…
CVE-2026-1131058.82026-10-20Use after free in Extensions in Google Chrome prior to 156.0.8078.47 allowed a remote attacker to execute arbitrary code inside the sandbox via a crafted HTML page. (Chr…
CVE-2026-1131068.82026-10-20Memory corruption in Skia in Google Chrome prior to 156.0.8078.47 allowed a remote attacker to execute arbitrary code inside the sandbox via a crafted HTML page. (Chromi…
CVE-2026-1131078.82026-10-20Use after free in Media in Google Chrome on on Android prior to 156.0.8078.47 allowed a remote attacker to execute arbitrary code inside the sandbox via a crafted HTML p…
CVE-2026-1131088.82026-10-20Use after free in Script in Google Chrome prior to 156.0.8078.47 allowed a remote attacker to execute arbitrary code inside the sandbox via a crafted HTML page. (Chromiu…
CVE-2026-1131098.82026-10-20Memory corruption in API in Google Chrome prior to 156.0.8078.47 allowed a remote attacker to potentially execute arbitrary code inside the sandbox via a crafted HTML pa…
CVE-2026-1131108.82026-10-20Memory corruption in ShadowDOM in Google Chrome prior to 156.0.8078.47 allowed a remote attacker to execute arbitrary code inside the sandbox via a crafted HTML page. (C…
CVE-2026-1130938.82026-10-20Memory corruption in DisplayLocking in Google Chrome prior to 156.0.8078.47 allowed a remote attacker to potentially execute arbitrary code inside the sandbox via a craf…
CVE-2026-1130948.82026-10-20Memory corruption in API in Google Chrome prior to 156.0.8078.47 allowed a remote attacker to execute arbitrary code inside the sandbox via a crafted HTML page. (Chromiu…
CVE-2026-1130958.82026-10-20Out of bounds read in Focus in Google Chrome prior to 156.0.8078.47 allowed a remote attacker to execute arbitrary code inside the sandbox via a crafted HTML page. (Chro…
CVE-2026-1130968.82026-10-20Memory corruption in Text in Google Chrome on on Android prior to 156.0.8078.47 allowed a remote attacker to execute arbitrary code inside the sandbox via a crafted HTML…
CVE-2026-1130978.82026-10-20Use after free in FileSystem in Google Chrome prior to 156.0.8078.47 allowed a remote attacker to potentially execute arbitrary code inside the sandbox via a crafted HTM…
CVE-2026-1130998.82026-10-20Improper input validation in Omnibox in Google Chrome on on Android prior to 156.0.8078.47 allowed a remote attacker to potentially execute arbitrary code inside the san…
CVE-2026-1131008.82026-10-20Memory corruption in Audio in Google Chrome prior to 156.0.8078.47 allowed a remote attacker to execute arbitrary code inside the sandbox via a crafted HTML page. (Chrom…
CVE-2026-1131018.82026-10-20Use after free in SiteIsolation in Google Chrome prior to 156.0.8078.47 allowed a remote attacker to execute arbitrary code inside the sandbox via a crafted HTML page. (…
CVE-2026-1130858.82026-10-20Use after free in Media in Google Chrome prior to 156.0.8078.47 allowed a remote attacker to execute arbitrary code inside the sandbox via a crafted HTML page. (Chromium…
CVE-2026-1130868.82026-10-20Improper input validation in Input in Google Chrome prior to 156.0.8078.47 allowed a remote attacker to potentially execute arbitrary code inside the sandbox via a craft…
CVE-2026-1130878.82026-10-20Use after free in Actor in Google Chrome prior to 156.0.8078.47 allowed a remote attacker to execute arbitrary code inside the sandbox via a crafted HTML page. (Chromium…
CVE-2026-1130888.82026-10-20Memory corruption in Mobile in Google Chrome on on Android prior to 156.0.8078.47 allowed a remote attacker to potentially execute arbitrary code inside the sandbox via …
CVE-2026-1130908.82026-10-20Memory corruption in Interstitials in Google Chrome prior to 156.0.8078.47 allowed a remote attacker to execute arbitrary code inside the sandbox via a crafted HTML page…
CVE-2026-1130918.82026-10-20Use after free in PerformanceAPIs in Google Chrome on on Android prior to 156.0.8078.47 allowed a remote attacker to execute arbitrary code inside the sandbox via a craf…
CVE-2026-1130928.82026-10-20Use after free in Passwords in Google Chrome on on Android prior to 156.0.8078.47 allowed a remote attacker to execute arbitrary code inside the sandbox via a crafted HT…
CVE-2026-1130758.82026-10-20Use after free in DevTools in Google Chrome prior to 156.0.8078.47 allowed a remote attacker to execute arbitrary code inside the sandbox via a crafted HTML page. (Chrom…
CVE-2026-1130818.82026-10-20Use after free in Compositing in Google Chrome prior to 156.0.8078.47 allowed a remote attacker to execute arbitrary code inside the sandbox via a crafted HTML page. (Ch…
CVE-2026-1130678.82026-10-20Use after free in Chromoting in Google Chrome prior to 156.0.8078.47 allowed a remote attacker to execute arbitrary code inside the sandbox via a crafted HTML page. (Chr…
CVE-2026-1130688.82026-10-20Use after free in Input in Google Chrome prior to 156.0.8078.47 allowed a remote attacker to execute arbitrary code inside the sandbox via a crafted HTML page. (Chromium…
CVE-2026-1130698.82026-10-20Memory corruption in Compositing in Google Chrome prior to 156.0.8078.47 allowed a remote attacker to execute arbitrary code inside the sandbox via a crafted HTML page. …
CVE-2026-1130718.82026-10-20Use after free in Notifications in Google Chrome on on Android prior to 156.0.8078.47 allowed a remote attacker to execute arbitrary code inside the sandbox via a crafte…
CVE-2026-1130738.82026-10-20Use after free in Browser in Google Chrome prior to 156.0.8078.47 allowed a remote attacker to execute arbitrary code inside the sandbox via a crafted HTML page. (Chromi…
CVE-2026-1130748.82026-10-20Use after free in Media in Google Chrome on on Windows prior to 156.0.8078.47 allowed a remote attacker to execute arbitrary code inside the sandbox via a crafted HTML p…
CVE-2026-1130578.82026-10-20Improper access control in ComputePressure in Google Chrome prior to 156.0.8078.47 allowed a remote attacker to bypass web origin policy via a crafted HTML page. (Chromi…
CVE-2026-1130588.82026-10-20Use after free in WebUI in Google Chrome prior to 156.0.8078.47 allowed a remote attacker to execute arbitrary code inside the sandbox via a crafted HTML page. (Chromium…
CVE-2026-1130598.82026-10-20Memory corruption in Sensor in Google Chrome prior to 156.0.8078.47 allowed a remote attacker to potentially execute arbitrary code inside the sandbox via a crafted HTML…
CVE-2026-1130608.82026-10-20Improper input validation in Bluetooth in Google Chrome prior to 156.0.8078.47 allowed a remote attacker to potentially execute arbitrary code inside the sandbox via a c…
CVE-2026-1130618.82026-10-20Memory corruption in Chromoting in Google Chrome prior to 156.0.8078.47 allowed a remote attacker to potentially execute arbitrary code inside the sandbox via a crafted …
CVE-2026-1130628.82026-10-20Improper input validation in API in Google Chrome prior to 156.0.8078.47 allowed a remote attacker to potentially execute arbitrary code inside the sandbox via a crafted…
CVE-2026-1130638.82026-10-20Improper input validation in Chromoting in Google Chrome prior to 156.0.8078.47 allowed a remote attacker to potentially execute arbitrary code inside the sandbox via a …
CVE-2026-1130648.82026-10-20Memory corruption in OptimizationGuide in Google Chrome prior to 156.0.8078.47 allowed a remote attacker to potentially execute arbitrary code inside the sandbox via a c…
CVE-2026-1130658.82026-10-20Use after free in Media in Google Chrome prior to 156.0.8078.47 allowed a remote attacker to execute arbitrary code inside the sandbox via a crafted HTML page. (Chromium…
CVE-2026-1130488.82026-10-20Memory corruption in DevTools in Google Chrome prior to 156.0.8078.47 allowed a remote attacker to potentially execute arbitrary code inside the sandbox via a crafted HT…
CVE-2026-1130498.82026-10-20Memory corruption in Core in Google Chrome prior to 156.0.8078.47 allowed a remote attacker to potentially execute arbitrary code inside the sandbox via a crafted HTML p…
CVE-2026-1130528.82026-10-20Memory corruption in V8 in Google Chrome prior to 156.0.8078.47 allowed a remote attacker to execute arbitrary code inside the sandbox via a crafted HTML page. (Chromium…
CVE-2026-1130538.82026-10-20Use after free in Cookies in Google Chrome on on Android prior to 156.0.8078.47 allowed a remote attacker to execute arbitrary code inside the sandbox via a crafted HTML…
CVE-2026-1130558.82026-10-20Type confusion in FullScreen in Google Chrome on on Android prior to 156.0.8078.47 allowed a remote attacker to execute arbitrary code inside the sandbox via a crafted H…
CVE-2026-1130408.82026-10-20Improper input validation in Proxy in Google Chrome prior to 156.0.8078.47 allowed a remote attacker to potentially execute arbitrary code inside the sandbox via a craft…
CVE-2026-1130418.82026-10-20Use after free in Actor in Google Chrome prior to 156.0.8078.47 allowed a remote attacker to execute arbitrary code inside the sandbox via a crafted HTML page. (Chromium…
CVE-2026-1130428.82026-10-20Use after free in Extensions in Google Chrome prior to 156.0.8078.47 allowed a remote attacker to execute arbitrary code inside the sandbox via a crafted HTML page. (Chr…
CVE-2026-1130438.82026-10-20Use after free in iOSWeb in Google Chrome on on iOS prior to 156.0.8078.47 allowed a remote attacker to execute arbitrary code inside the sandbox via a crafted HTML page…
CVE-2026-1130448.82026-10-20Use after free in V8 in Google Chrome prior to 156.0.8078.47 allowed a remote attacker to execute arbitrary code inside the sandbox via a crafted HTML page. (Chromium se…
CVE-2026-1130468.82026-10-20Improper input validation in Passwords in Google Chrome prior to 156.0.8078.47 allowed a remote attacker to potentially execute arbitrary code inside the sandbox via a c…
CVE-2026-1130318.82026-10-20Memory corruption in Media in Google Chrome on on Windows prior to 156.0.8078.47 allowed a remote attacker to execute arbitrary code inside the sandbox via a crafted HTM…
CVE-2026-1130328.82026-10-20Memory corruption in Omnibox in Google Chrome on on Android prior to 156.0.8078.47 allowed a remote attacker to execute arbitrary code inside the sandbox via a crafted H…
CVE-2026-1130338.82026-10-20Use after free in Streaming in Google Chrome prior to 156.0.8078.47 allowed a remote attacker to execute arbitrary code inside the sandbox via a crafted HTML page. (Chro…
CVE-2026-1130348.82026-10-20Memory corruption in FileSystem in Google Chrome prior to 156.0.8078.47 allowed a remote attacker to execute arbitrary code inside the sandbox via a crafted HTML page. (…
CVE-2026-1130368.82026-10-20Memory corruption in HTML in Google Chrome prior to 156.0.8078.47 allowed a remote attacker to potentially execute arbitrary code inside the sandbox via a crafted HTML p…
CVE-2026-1130378.82026-10-20Use after free in WebSockets in Google Chrome prior to 156.0.8078.47 allowed a remote attacker to execute arbitrary code inside the sandbox via a crafted HTML page. (Chr…
CVE-2026-1130398.82026-10-20Use after free in Bookmarks in Google Chrome prior to 156.0.8078.47 allowed a remote attacker to execute arbitrary code inside the sandbox via a crafted HTML page. (Chro…
CVE-2026-1130228.82026-10-20Memory corruption in PDFium in Google Chrome prior to 156.0.8078.47 allowed a remote attacker to potentially execute arbitrary code inside the sandbox via a crafted HTML…
CVE-2026-1130248.82026-10-20Use after free in WebAppInstalls in Google Chrome prior to 156.0.8078.47 allowed a remote attacker to execute arbitrary code inside the sandbox via a crafted HTML page. …
CVE-2026-1130258.82026-10-20Use after free in Input in Google Chrome prior to 156.0.8078.47 allowed a remote attacker to execute arbitrary code inside the sandbox via a crafted HTML page. (Chromium…
CVE-2026-1130278.82026-10-20Memory corruption in WebFonts in Google Chrome prior to 156.0.8078.47 allowed a remote attacker to potentially execute arbitrary code inside the sandbox via a crafted HT…
CVE-2026-1130288.82026-10-20Use after free in Media in Google Chrome prior to 156.0.8078.47 allowed a remote attacker to execute arbitrary code inside the sandbox via a crafted HTML page. (Chromium…
CVE-2026-1130298.82026-10-20Improper access control in ANGLE in Google Chrome prior to 156.0.8078.47 allowed a remote attacker to potentially execute arbitrary code inside the sandbox via a crafted…
CVE-2026-1130308.82026-10-20Improper access control in V8 in Google Chrome prior to 156.0.8078.47 allowed a remote attacker to potentially bypass web origin policy via a crafted HTML page. (Chromiu…
CVE-2026-1130158.82026-10-20Use after free in Workers in Google Chrome prior to 156.0.8078.47 allowed a remote attacker to execute arbitrary code inside the sandbox via a crafted HTML page. (Chromi…
CVE-2026-1130168.82026-10-20Improper input validation in Extensions in Google Chrome prior to 156.0.8078.47 allowed a remote attacker to potentially execute arbitrary code inside the sandbox via a …
CVE-2026-1130178.82026-10-20Use after free in Views in Google Chrome prior to 156.0.8078.47 allowed a remote attacker to execute arbitrary code inside the sandbox via a crafted HTML page. (Chromium…
CVE-2026-1130188.82026-10-20Memory corruption in IME in Google Chrome prior to 156.0.8078.47 allowed a remote attacker to potentially execute arbitrary code inside the sandbox via a crafted HTML pa…
CVE-2026-1130198.82026-10-20Use after free in Turbolev in Google Chrome prior to 156.0.8078.47 allowed a remote attacker to execute arbitrary code inside the sandbox via a crafted HTML page. (Chrom…
CVE-2026-1130218.82026-10-20Use after free in WebAppInstalls in Google Chrome prior to 156.0.8078.47 allowed a remote attacker to execute arbitrary code inside the sandbox via a crafted HTML page. …
CVE-2026-1130068.82026-10-20Out of bounds read in Navigation in Google Chrome prior to 156.0.8078.47 allowed a remote attacker to potentially execute arbitrary code inside the sandbox via a crafted…
CVE-2026-1130088.82026-10-20Memory corruption in Transactions Platform in Google Chrome prior to 156.0.8078.47 allowed a remote attacker to potentially execute arbitrary code inside the sandbox via…
CVE-2026-1130098.82026-10-20Use after free in WindowControlsOverlay in Google Chrome prior to 156.0.8078.47 allowed a remote attacker to execute arbitrary code inside the sandbox via a crafted HTML…
CVE-2026-1130118.82026-10-20Use after free in CredentialProvider in Google Chrome on on Windows prior to 156.0.8078.47 allowed a remote attacker to execute arbitrary code inside the sandbox via a c…
CVE-2026-1130128.82026-10-20Improper input validation in GPU in Google Chrome prior to 156.0.8078.47 allowed a remote attacker to potentially execute arbitrary code inside the sandbox via a crafted…
CVE-2026-1130138.82026-10-20Memory corruption in DevTools in Google Chrome prior to 156.0.8078.47 allowed a remote attacker to execute arbitrary code inside the sandbox via a crafted HTML page. (Ch…
CVE-2026-1129968.82026-10-20Memory corruption in Loader in Google Chrome prior to 156.0.8078.47 allowed a remote attacker to execute arbitrary code inside the sandbox via a crafted HTML page. (Chro…
CVE-2026-1129978.82026-10-20Memory corruption in CSS in Google Chrome prior to 156.0.8078.47 allowed a remote attacker to potentially execute arbitrary code inside the sandbox via a crafted HTML pa…
CVE-2026-1129988.82026-10-20Memory corruption in Views in Google Chrome prior to 156.0.8078.47 allowed a remote attacker to execute arbitrary code inside the sandbox via a crafted HTML page. (Chrom…
CVE-2026-1129998.82026-10-20Use after free in API in Google Chrome prior to 156.0.8078.47 allowed a remote attacker to execute arbitrary code inside the sandbox via a crafted HTML page. (Chromium s…
CVE-2026-1130008.82026-10-20Memory corruption in Paint in Google Chrome prior to 156.0.8078.47 allowed a remote attacker to execute arbitrary code inside the sandbox via a crafted HTML page. (Chrom…
CVE-2026-1130018.82026-10-20Use after free in Workers in Google Chrome prior to 156.0.8078.47 allowed a remote attacker to execute arbitrary code inside the sandbox via a crafted HTML page. (Chromi…
CVE-2026-1130038.82026-10-20Memory corruption in HID in Google Chrome prior to 156.0.8078.47 allowed a remote attacker to execute arbitrary code inside the sandbox via a crafted HTML page. (Chromiu…
CVE-2026-1130048.82026-10-20Memory corruption in Sync in Google Chrome prior to 156.0.8078.47 allowed a remote attacker to execute arbitrary code inside the sandbox via a crafted HTML page. (Chromi…
CVE-2026-1130058.82026-10-20Memory corruption in Bluetooth in Google Chrome prior to 156.0.8078.47 allowed a remote attacker to potentially execute arbitrary code inside the sandbox via a crafted H…
CVE-2026-1129958.82026-10-20Use after free in Animation in Google Chrome prior to 156.0.8078.47 allowed a remote attacker to execute arbitrary code inside the sandbox via a crafted HTML page. (Chro…
CVE-2026-1129938.82026-10-20Use after free in Input in Google Chrome prior to 156.0.8078.47 allowed a remote attacker to execute arbitrary code inside the sandbox via a crafted HTML page. (Chromium…
CVE-2026-1129948.82026-10-20Memory corruption in Browser in Google Chrome prior to 156.0.8078.47 allowed a remote attacker to execute arbitrary code inside the sandbox via a crafted HTML page. (Chr…
CVE-2026-1130838.82026-10-20Memory corruption in Actor in Google Chrome on on Android prior to 156.0.8078.47 allowed a remote attacker to execute arbitrary code inside the sandbox via a crafted HTM…
CVE-2026-1131808.82026-10-20Memory corruption in ContentCapture in Google Chrome on on Android prior to 156.0.8078.47 allowed a remote attacker to execute arbitrary code inside the sandbox via a cr…
CVE-2026-1130808.82026-10-20Use after free in WebAppInstalls in Google Chrome prior to 156.0.8078.47 allowed a remote attacker to execute arbitrary code inside the sandbox via a crafted HTML page. …
CVE-2026-1131708.82026-10-20Use after free in Autofill in Google Chrome on on Android prior to 156.0.8078.47 allowed a remote attacker to execute arbitrary code inside the sandbox via a crafted HTM…
CVE-2026-1130768.82026-10-20Use after free in Toolbar in Google Chrome on on Android prior to 156.0.8078.47 allowed a remote attacker to execute arbitrary code inside the sandbox via a crafted HTML…
CVE-2026-1132208.82026-10-20Memory corruption in Extensions in Google Chrome on on Android prior to 156.0.8078.47 allowed a remote attacker to potentially execute arbitrary code inside the sandbox …
CVE-2026-1130798.82026-10-20Use after free in SiteIsolation in Google Chrome prior to 156.0.8078.47 allowed a remote attacker to potentially execute arbitrary code inside the sandbox via a crafted …
CVE-2026-1133406.52026-10-20Memory corruption in ANGLE in Google Chrome on on Windows prior to 156.0.8078.47 allowed a remote attacker to potentially read memory inside the sandbox via a crafted HT…
CVE-2026-1133416.52026-10-20Memory corruption in Skia in Google Chrome on on Android prior to 156.0.8078.47 allowed a remote attacker to potentially read memory inside the sandbox via a crafted HTM…
CVE-2026-1133266.52026-10-20Memory corruption in Core in Google Chrome on on Windows prior to 156.0.8078.47 allowed a remote attacker to potentially read memory inside the sandbox via a crafted HTM…
CVE-2026-1133296.52026-10-20Out of bounds read in Installer in Google Chrome on on Mac prior to 156.0.8078.47 allowed a remote attacker to potentially read memory inside the sandbox via a crafted H…
CVE-2026-1133336.52026-10-20Memory corruption in Extensions in Google Chrome prior to 156.0.8078.47 allowed a remote attacker to potentially read memory inside the sandbox via a crafted HTML page. …
CVE-2026-1133226.52026-10-20Memory corruption in Dawn in Google Chrome prior to 156.0.8078.47 allowed a remote attacker to potentially read memory inside the sandbox via a crafted HTML page. (Chrom…
CVE-2026-1133256.52026-10-20Memory corruption in SignIn in Google Chrome on on iOS prior to 156.0.8078.47 allowed a remote attacker to potentially read memory inside the sandbox via a crafted HTML …
CVE-2026-1133096.52026-10-20Out of bounds read in Media in Google Chrome prior to 156.0.8078.47 allowed a remote attacker to read memory inside the sandbox via a crafted HTML page. (Chromium securi…
CVE-2026-1133106.52026-10-20Out of bounds read in Bluetooth in Google Chrome prior to 156.0.8078.47 allowed a remote attacker to read memory inside the sandbox via a crafted HTML page. (Chromium se…
CVE-2026-1133046.52026-10-20Memory corruption in GPU in Google Chrome on on Android prior to 156.0.8078.47 allowed a remote attacker to potentially read memory inside the sandbox via a crafted HTML…
CVE-2026-1132956.52026-10-20Out of bounds read in ANGLE in Google Chrome on on Windows prior to 156.0.8078.47 allowed a remote attacker to read memory inside the sandbox via a crafted HTML page. (C…
CVE-2026-1132966.52026-10-20Memory corruption in Actor in Google Chrome prior to 156.0.8078.47 allowed a remote attacker to potentially read memory inside the sandbox via a crafted HTML page. (Chro…
CVE-2026-1132976.52026-10-20Improper access control in Ozone in Google Chrome prior to 156.0.8078.47 allowed a remote attacker to leak sensitive information via a crafted HTML page. (Chromium secur…
CVE-2026-1132776.52026-10-20Out of bounds read in CustomTabs in Google Chrome on on Android prior to 156.0.8078.47 allowed a remote attacker to read memory inside the sandbox via a crafted HTML pag…
CVE-2026-1132466.52026-10-20Memory corruption in iOSWebView in Google Chrome on on iOS prior to 156.0.8078.47 allowed a remote attacker to potentially read memory inside the sandbox via a crafted H…
CVE-2026-1132376.52026-10-20Memory corruption in Chromoting in Google Chrome prior to 156.0.8078.47 allowed a remote attacker to read memory inside the sandbox via a crafted HTML page. (Chromium se…
CVE-2026-1132236.52026-10-20Memory corruption in DevTools in Google Chrome prior to 156.0.8078.47 allowed a remote attacker to potentially read memory inside the sandbox via a crafted HTML page. (C…
CVE-2026-1132256.52026-10-20Memory corruption in Browser in Google Chrome on on Android prior to 156.0.8078.47 allowed a remote attacker to potentially read memory inside the sandbox via a crafted …
CVE-2026-1132016.52026-10-20Memory corruption in Google Lens in Google Chrome prior to 156.0.8078.47 allowed a remote attacker to potentially read memory inside the sandbox via a crafted HTML page.…
CVE-2026-1131936.52026-10-20Memory corruption in V8 in Google Chrome prior to 156.0.8078.47 allowed a remote attacker to potentially read memory inside the sandbox via a crafted HTML page. (Chromiu…
CVE-2026-1131996.52026-10-20Out of bounds read in Payments in Google Chrome prior to 156.0.8078.47 allowed a remote attacker to read memory inside the sandbox via a crafted HTML page. (Chromium sec…
CVE-2026-1131786.52026-10-20Memory corruption in Views in Google Chrome on on Mac prior to 156.0.8078.47 allowed a remote attacker to potentially read memory inside the sandbox via a crafted HTML p…
CVE-2026-1131576.52026-10-20Information leak in ANGLE in Google Chrome on on Windows prior to 156.0.8078.47 allowed a remote attacker to leak sensitive information via a crafted HTML page. (Chromiu…
CVE-2026-1131596.52026-10-20Improper access control in DevTools in Google Chrome prior to 156.0.8078.47 allowed a remote attacker to potentially leak sensitive information via a crafted HTML page. …
CVE-2026-1131516.52026-10-20Out of bounds read in Actor in Google Chrome prior to 156.0.8078.47 allowed a remote attacker to read memory inside the sandbox via a crafted HTML page. (Chromium securi…
CVE-2026-1131396.52026-10-20Memory corruption in Autofill in Google Chrome prior to 156.0.8078.47 allowed a remote attacker to potentially read memory inside the sandbox via a crafted HTML page. (C…
CVE-2026-1131426.52026-10-20Memory corruption in Extensions in Google Chrome prior to 156.0.8078.47 allowed a remote attacker to potentially read memory inside the sandbox via a crafted HTML page. …
CVE-2026-1131446.52026-10-20Memory corruption in Speech in Google Chrome prior to 156.0.8078.47 allowed a remote attacker to read memory inside the sandbox via a crafted HTML page. (Chromium securi…
CVE-2026-1131296.52026-10-20Improper access control in Extensions in Google Chrome prior to 156.0.8078.47 allowed a remote attacker to potentially leak sensitive information via a crafted HTML page…
CVE-2026-1131226.52026-10-20Memory corruption in Loader in Google Chrome prior to 156.0.8078.47 allowed a remote attacker to potentially read memory inside the sandbox via a crafted HTML page. (Chr…
CVE-2026-1131026.52026-10-20Out of bounds read in FileSystem in Google Chrome prior to 156.0.8078.47 allowed a remote attacker to read memory inside the sandbox via a crafted HTML page. (Chromium s…
CVE-2026-1130986.52026-10-20Memory corruption in CacheStorage in Google Chrome prior to 156.0.8078.47 allowed a remote attacker to potentially read memory inside the sandbox via a crafted HTML page…
CVE-2026-1130666.52026-10-20Memory corruption in Fonts in Google Chrome prior to 156.0.8078.47 allowed a remote attacker to read memory inside the sandbox via a crafted HTML page. (Chromium securit…
CVE-2026-1130706.52026-10-20Out of bounds read in GetUserMedia in Google Chrome prior to 156.0.8078.47 allowed a remote attacker to read memory inside the sandbox via a crafted HTML page. (Chromium…
CVE-2026-1130506.52026-10-20Out of bounds read in HID in Google Chrome prior to 156.0.8078.47 allowed a remote attacker to read memory inside the sandbox via a crafted HTML page. (Chromium security…
CVE-2026-1130516.52026-10-20Memory corruption in CSS in Google Chrome prior to 156.0.8078.47 allowed a remote attacker to potentially read memory inside the sandbox via a crafted HTML page. (Chromi…
CVE-2026-1130546.52026-10-20Out of bounds read in SiteIsolation in Google Chrome prior to 156.0.8078.47 allowed a remote attacker to read memory inside the sandbox via a crafted HTML page. (Chromiu…
CVE-2026-1130456.52026-10-20Out of bounds read in Offline in Google Chrome on on Android prior to 156.0.8078.47 allowed a remote attacker to potentially read memory inside the sandbox via a crafted…
CVE-2026-1130476.52026-10-20Memory corruption in BrowserTag in Google Chrome prior to 156.0.8078.47 allowed a remote attacker to potentially read memory inside the sandbox via a crafted HTML page. …
CVE-2026-1130356.52026-10-20Out of bounds read in API in Google Chrome prior to 156.0.8078.47 allowed a remote attacker to potentially read memory inside the sandbox via a crafted HTML page. (Chrom…
CVE-2026-1130386.52026-10-20Memory corruption in DevTools in Google Chrome prior to 156.0.8078.47 allowed a remote attacker to potentially read memory inside the sandbox via a crafted HTML page. (C…
CVE-2026-1130266.52026-10-20Memory corruption in PDF in Google Chrome on on Android prior to 156.0.8078.47 allowed a remote attacker to potentially read memory inside the sandbox via a crafted HTML…
CVE-2026-1130106.52026-10-20Out of bounds read in Extensions in Google Chrome prior to 156.0.8078.47 allowed a remote attacker to read memory inside the sandbox via a crafted HTML page. (Chromium s…
CVE-2026-1130026.52026-10-20Memory corruption in Transactions Platform in Google Chrome prior to 156.0.8078.47 allowed a remote attacker to potentially read memory inside the sandbox via a crafted …
CVE-2026-1130776.52026-10-20Memory corruption in Core in Google Chrome on on Mac prior to 156.0.8078.47 allowed a remote attacker to potentially read memory inside the sandbox via a crafted HTML pa…
CVE-2026-1132246.52026-10-20Memory corruption in WebAppInstalls in Google Chrome on on Android prior to 156.0.8078.47 allowed a remote attacker to potentially read memory inside the sandbox via a c…
CVE-2026-1132096.52026-10-20Memory corruption in Navigation in Google Chrome on on iOS prior to 156.0.8078.47 allowed a remote attacker to potentially read memory inside the sandbox via a crafted H…
CVE-2026-1130826.52026-10-20Memory corruption in ANGLE in Google Chrome on on Windows prior to 156.0.8078.47 allowed a remote attacker to potentially read memory inside the sandbox via a crafted HT…
CVE-2026-113196–2026-10-20Improper access control in Mobile in Google Chrome on on iOS prior to 156.0.8078.47 allowed a remote attacker to bypass web origin policy via a crafted HTML page. (Chrom…
CVE-2026-113212–2026-10-20Memory corruption in PDF in Google Chrome prior to 156.0.8078.47 allowed a remote attacker to potentially via a crafted HTML page. (Chromium security severity: High)
chromium -- security fixesentered 2026-10-22

CVE-2026-112992, CVE-2026-112993, CVE-2026-112994, CVE-2026-112995, CVE-2026-112996, CVE-2026-112997, CVE-2026-112998, CVE-2026-112999, CVE-2026-113000, CVE-2026-113001, CVE-2026-113002, CVE-2026-113003, CVE-2026-113004, CVE-2026-113005, CVE-2026-113006, CVE-2026-113007, CVE-2026-113008, CVE-2026-113009, CVE-2026-113010, CVE-2026-113011, CVE-2026-113012, CVE-2026-113013, CVE-2026-113014, CVE-2026-113015, CVE-2026-113016, CVE-2026-113017, CVE-2026-113018, CVE-2026-113019, CVE-2026-113020, CVE-2026-113021, CVE-2026-113022, CVE-2026-113023, CVE-2026-113024, CVE-2026-113025, CVE-2026-113026, CVE-2026-113027, CVE-2026-113028, CVE-2026-113029, CVE-2026-113030, CVE-2026-113031, CVE-2026-113032, CVE-2026-113033, CVE-2026-113034, CVE-2026-113035, CVE-2026-113036, CVE-2026-113037, CVE-2026-113038, CVE-2026-113039, CVE-2026-113040, CVE-2026-113041, CVE-2026-113042, CVE-2026-113043, CVE-2026-113044, CVE-2026-113045, CVE-2026-113046, CVE-2026-113047, CVE-2026-113048, CVE-2026-113049, CVE-2026-113050, CVE-2026-113051, CVE-2026-113052, CVE-2026-113053, CVE-2026-113054, CVE-2026-113055,

chromium -- security fixesentered 2026-09-26

CVE-2026-95274, CVE-2026-95275, CVE-2026-95276, CVE-2026-95277, CVE-2026-95278, CVE-2026-95279, CVE-2026-95280, CVE-2026-95281, CVE-2026-95282, CVE-2026-95283, CVE-2026-95284, CVE-2026-95285, CVE-2026-95286, CVE-2026-95287, CVE-2026-95288, CVE-2026-95289, CVE-2026-95290, CVE-2026-95291, CVE-2026-95292, CVE-2026-95293, CVE-2026-95294, CVE-2026-95295, CVE-2026-95296, CVE-2026-95297, CVE-2026-95298, CVE-2026-95299, CVE-2026-95300, CVE-2026-95301, CVE-2026-95302, CVE-2026-95303, CVE-2026-95304, CVE-2026-95305, CVE-2026-95306, CVE-2026-95307, CVE-2026-95308, CVE-2026-95309, CVE-2026-95310, CVE-2026-95311, CVE-2026-95312, CVE-2026-95313, CVE-2026-95314, CVE-2026-95315, CVE-2026-95316, CVE-2026-95317, CVE-2026-95318, CVE-2026-95319, CVE-2026-95320, CVE-2026-95321, CVE-2026-95322, CVE-2026-95323, CVE-2026-95324, CVE-2026-95325, CVE-2026-95326, CVE-2026-95327, CVE-2026-95328, CVE-2026-95329, CVE-2026-95330, CVE-2026-95331, CVE-2026-95332, CVE-2026-95333, CVE-2026-95334, CVE-2026-95335, CVE-2026-95336, CVE-2026-95337, CVE-2026-95338, CVE-2026-95339, CVE-2026-95340, CVE-2026-95341, CVE-

chromium -- security fixesentered 2026-08-31

CVE-2026-78891, CVE-2026-78892, CVE-2026-78893, CVE-2026-78894, CVE-2026-78895, CVE-2026-78896, CVE-2026-78897, CVE-2026-78898, CVE-2026-78899, CVE-2026-78900, CVE-2026-78901, CVE-2026-78903, CVE-2026-78904, CVE-2026-78905, CVE-2026-78906, CVE-2026-78907, CVE-2026-78908, CVE-2026-78909, CVE-2026-78910, CVE-2026-78911, CVE-2026-78912, CVE-2026-78913, CVE-2026-78914, CVE-2026-78915, CVE-2026-78934, CVE-2026-78935, CVE-2026-78936, CVE-2026-78937, CVE-2026-78938, CVE-2026-78939, CVE-2026-78940, CVE-2026-78941, CVE-2026-78942, CVE-2026-78943, CVE-2026-78944, CVE-2026-78945, CVE-2026-78946, CVE-2026-78947, CVE-2026-78948, CVE-2026-78949, CVE-2026-78950, CVE-2026-78951, CVE-2026-78952, CVE-2026-78953, CVE-2026-78954, CVE-2026-78955, CVE-2026-78956, CVE-2026-78957, CVE-2026-78958, CVE-2026-78959, CVE-2026-78960, CVE-2026-78961, CVE-2026-78962, CVE-2026-78963, CVE-2026-78964, CVE-2026-78965, CVE-2026-78966, CVE-2026-78967, CVE-2026-78968, CVE-2026-78969, CVE-2026-78974, CVE-2026-78975, CVE-2026-78976, CVE-2026-78977, CVE-2026-78978, CVE-2026-78979, CVE-2026-78980, CVE-2026-78981, CVE-

chromium -- security fixesentered 2026-08-13

CVE-2026-19137, CVE-2026-19138, CVE-2026-19139, CVE-2026-19140, CVE-2026-19141, CVE-2026-19142, CVE-2026-19143, CVE-2026-19144, CVE-2026-19145, CVE-2026-19146, CVE-2026-19147, CVE-2026-19148, CVE-2026-19149, CVE-2026-19150, CVE-2026-19151, CVE-2026-19152, CVE-2026-19153, CVE-2026-19154, CVE-2026-19155, CVE-2026-19156, CVE-2026-19157, CVE-2026-19158, CVE-2026-19159, CVE-2026-19160, CVE-2026-19161, CVE-2026-19162, CVE-2026-19163, CVE-2026-19164, CVE-2026-19165, CVE-2026-19166, CVE-2026-19167, CVE-2026-19168, CVE-2026-19169, CVE-2026-19170, CVE-2026-19171, CVE-2026-19172, CVE-2026-19173, CVE-2026-19174, CVE-2026-19175, CVE-2026-19176, CVE-2026-19177

chromium -- security fixesentered 2026-07-30

CVE-2026-17650, CVE-2026-17651, CVE-2026-17652, CVE-2026-17653, CVE-2026-17654, CVE-2026-17655, CVE-2026-17656, CVE-2026-17657, CVE-2026-17658, CVE-2026-17659, CVE-2026-17660, CVE-2026-17661, CVE-2026-17662, CVE-2026-17663, CVE-2026-17664, CVE-2026-17665, CVE-2026-17666, CVE-2026-17667, CVE-2026-17668, CVE-2026-17669, CVE-2026-17670, CVE-2026-17671, CVE-2026-17672, CVE-2026-17673, CVE-2026-17674, CVE-2026-17675, CVE-2026-17676, CVE-2026-17677, CVE-2026-17678, CVE-2026-17679, CVE-2026-17680, CVE-2026-17681, CVE-2026-17682, CVE-2026-17683, CVE-2026-17684, CVE-2026-17685, CVE-2026-17686, CVE-2026-17687, CVE-2026-17688, CVE-2026-17689, CVE-2026-17690, CVE-2026-17691, CVE-2026-17692, CVE-2026-17693, CVE-2026-17694, CVE-2026-17695, CVE-2026-17696, CVE-2026-17697, CVE-2026-17698, CVE-2026-17699, CVE-2026-17700, CVE-2026-17701, CVE-2026-17702, CVE-2026-17703, CVE-2026-17704, CVE-2026-17705, CVE-2026-17706, CVE-2026-17707, CVE-2026-17708, CVE-2026-17709, CVE-2026-17710, CVE-2026-17711, CVE-2026-17712, CVE-2026-17713, CVE-2026-17714, CVE-2026-17715, CVE-2026-17716, CVE-2026-17717, CVE-

chromium -- security fixesentered 2026-07-02

CVE-2026-13774, CVE-2026-13775, CVE-2026-13776, CVE-2026-13777, CVE-2026-13778, CVE-2026-13779, CVE-2026-13780, CVE-2026-13781, CVE-2026-13782, CVE-2026-13783, CVE-2026-13784, CVE-2026-13785, CVE-2026-13786, CVE-2026-13787, CVE-2026-13788, CVE-2026-13789, CVE-2026-13790, CVE-2026-13791, CVE-2026-13792, CVE-2026-13793, CVE-2026-13794, CVE-2026-13795, CVE-2026-13796, CVE-2026-13797, CVE-2026-13798, CVE-2026-13799, CVE-2026-13800, CVE-2026-13801, CVE-2026-13802, CVE-2026-13803, CVE-2026-13804, CVE-2026-13805, CVE-2026-13806, CVE-2026-13807, CVE-2026-13808, CVE-2026-13809, CVE-2026-13810, CVE-2026-13811, CVE-2026-13812, CVE-2026-13813, CVE-2026-13814, CVE-2026-13815, CVE-2026-13816, CVE-2026-13817, CVE-2026-13818, CVE-2026-13819, CVE-2026-13820, CVE-2026-13821, CVE-2026-13822, CVE-2026-13823, CVE-2026-13824, CVE-2026-13825, CVE-2026-13826, CVE-2026-13827, CVE-2026-13828, CVE-2026-13829, CVE-2026-13830, CVE-2026-13831, CVE-2026-13832, CVE-2026-13833, CVE-2026-13834, CVE-2026-13835, CVE-2026-13836, CVE-2026-13837, CVE-2026-13838, CVE-2026-13839, CVE-2026-13840, CVE-2026-13841, CVE-

chromium -- security fixesentered 2026-06-15

CVE-2026-12437, CVE-2026-12438, CVE-2026-12439, CVE-2026-12440, CVE-2026-12441, CVE-2026-12442, CVE-2026-12443, CVE-2026-12444, CVE-2026-12445, CVE-2026-12446, CVE-2026-12447, CVE-2026-12448, CVE-2026-12449, CVE-2026-12450, CVE-2026-12451, CVE-2026-12452, CVE-2026-12453, CVE-2026-12454, CVE-2026-12455, CVE-2026-12456, CVE-2026-12457, CVE-2026-12458, CVE-2026-12459, CVE-2026-12460, CVE-2026-12461, CVE-2026-12462, CVE-2026-12463, CVE-2026-12464, CVE-2026-12465, CVE-2026-12466, CVE-2026-12467, CVE-2026-12468, CVE-2026-12469

chromium -- security fixesentered 2026-06-10

CVE-2026-11628, CVE-2026-11629, CVE-2026-11630, CVE-2026-11631, CVE-2026-11632, CVE-2026-11633, CVE-2026-11634, CVE-2026-11635, CVE-2026-11636, CVE-2026-11637, CVE-2026-11638, CVE-2026-11639, CVE-2026-11640, CVE-2026-11641, CVE-2026-11642, CVE-2026-11643, CVE-2026-11644, CVE-2026-11645, CVE-2026-11646, CVE-2026-11647, CVE-2026-11648, CVE-2026-11649, CVE-2026-11650, CVE-2026-11651, CVE-2026-11652, CVE-2026-11653, CVE-2026-11654, CVE-2026-11655, CVE-2026-11656, CVE-2026-11657, CVE-2026-11658, CVE-2026-11659, CVE-2026-11660, CVE-2026-11661, CVE-2026-11662, CVE-2026-11663, CVE-2026-11664, CVE-2026-11665, CVE-2026-11666, CVE-2026-11667, CVE-2026-11668, CVE-2026-11669, CVE-2026-11670, CVE-2026-11671, CVE-2026-11672, CVE-2026-11673, CVE-2026-11674, CVE-2026-11675, CVE-2026-11676, CVE-2026-11677, CVE-2026-11678, CVE-2026-11679, CVE-2026-11680, CVE-2026-11681, CVE-2026-11682, CVE-2026-11683, CVE-2026-11684, CVE-2026-11685, CVE-2026-11686, CVE-2026-11687, CVE-2026-11688, CVE-2026-11689, CVE-2026-11690, CVE-2026-11691, CVE-2026-11692, CVE-2026-11693, CVE-2026-11694, CVE-2026-11695, CVE-

chromium -- security fixesentered 2026-05-30

CVE-2026-10000, CVE-2026-10001, CVE-2026-10002, CVE-2026-10003, CVE-2026-10004, CVE-2026-10005, CVE-2026-10006, CVE-2026-10007, CVE-2026-10008, CVE-2026-10009, CVE-2026-10010, CVE-2026-10011, CVE-2026-10012, CVE-2026-10013, CVE-2026-10014, CVE-2026-10015, CVE-2026-10016, CVE-2026-10017, CVE-2026-10018, CVE-2026-10019, CVE-2026-10020, CVE-2026-10021, CVE-2026-10022, CVE-2026-9872, CVE-2026-9873, CVE-2026-9874, CVE-2026-9875, CVE-2026-9876, CVE-2026-9877, CVE-2026-9878, CVE-2026-9879, CVE-2026-9880, CVE-2026-9881, CVE-2026-9882, CVE-2026-9883, CVE-2026-9884, CVE-2026-9885, CVE-2026-9886, CVE-2026-9887, CVE-2026-9888, CVE-2026-9889, CVE-2026-9890, CVE-2026-9891, CVE-2026-9892, CVE-2026-9893, CVE-2026-9894, CVE-2026-9895, CVE-2026-9896, CVE-2026-9897, CVE-2026-9898, CVE-2026-9899, CVE-2026-9900, CVE-2026-9901, CVE-2026-9902, CVE-2026-9903, CVE-2026-9904, CVE-2026-9905, CVE-2026-9906, CVE-2026-9907, CVE-2026-9908, CVE-2026-9909, CVE-2026-9910, CVE-2026-9911, CVE-2026-9912, CVE-2026-9913, CVE-2026-9914, CVE-2026-9915, CVE-2026-9916, CVE-2026-9917, CVE-2026-9918, CVE-2026-9919, CVE-202

chromium -- security fixesentered 2026-05-08

CVE-2026-7896, CVE-2026-7897, CVE-2026-7898, CVE-2026-7899, CVE-2026-7900, CVE-2026-7901, CVE-2026-7902, CVE-2026-7903, CVE-2026-7904, CVE-2026-7905, CVE-2026-7906, CVE-2026-7907, CVE-2026-7908, CVE-2026-7909, CVE-2026-7910, CVE-2026-7911, CVE-2026-7912, CVE-2026-7913, CVE-2026-7914, CVE-2026-7915, CVE-2026-7916, CVE-2026-7917, CVE-2026-7918, CVE-2026-7919, CVE-2026-7920, CVE-2026-7921, CVE-2026-7922, CVE-2026-7923, CVE-2026-7924, CVE-2026-7925, CVE-2026-7926, CVE-2026-7927, CVE-2026-7928, CVE-2026-7929, CVE-2026-7930, CVE-2026-7931, CVE-2026-7932, CVE-2026-7933, CVE-2026-7934, CVE-2026-7935, CVE-2026-7936, CVE-2026-7937, CVE-2026-7938, CVE-2026-7939, CVE-2026-7940, CVE-2026-7941, CVE-2026-7942, CVE-2026-7943, CVE-2026-7944, CVE-2026-7945, CVE-2026-7946, CVE-2026-7947, CVE-2026-7948, CVE-2026-7949, CVE-2026-7950, CVE-2026-7951, CVE-2026-7952, CVE-2026-7953, CVE-2026-7954, CVE-2026-7955, CVE-2026-7956, CVE-2026-7957, CVE-2026-7958, CVE-2026-7959, CVE-2026-7960, CVE-2026-7961, CVE-2026-7962, CVE-2026-7963, CVE-2026-7964, CVE-2026-7965, CVE-2026-7966, CVE-2026-7967, CVE-2026-7968, CV

chromium -- security fixesentered 2026-04-16

CVE-2026-6296, CVE-2026-6297, CVE-2026-6298, CVE-2026-6299, CVE-2026-6300, CVE-2026-6301, CVE-2026-6302, CVE-2026-6303, CVE-2026-6304, CVE-2026-6305, CVE-2026-6306, CVE-2026-6307, CVE-2026-6308, CVE-2026-6309, CVE-2026-6310, CVE-2026-6311, CVE-2026-6312, CVE-2026-6313, CVE-2026-6314, CVE-2026-6315, CVE-2026-6316, CVE-2026-6317, CVE-2026-6318, CVE-2026-6319, CVE-2026-6358, CVE-2026-6359, CVE-2026-6360, CVE-2026-6361, CVE-2026-6362, CVE-2026-6363, CVE-2026-6364

chromium -- security fixesentered 2026-04-10

CVE-2026-5858, CVE-2026-5859, CVE-2026-5860, CVE-2026-5861, CVE-2026-5862, CVE-2026-5863, CVE-2026-5864, CVE-2026-5865, CVE-2026-5866, CVE-2026-5867, CVE-2026-5868, CVE-2026-5869, CVE-2026-5870, CVE-2026-5871, CVE-2026-5872, CVE-2026-5873, CVE-2026-5874, CVE-2026-5875, CVE-2026-5876, CVE-2026-5877, CVE-2026-5878, CVE-2026-5879, CVE-2026-5880, CVE-2026-5881, CVE-2026-5882, CVE-2026-5883, CVE-2026-5884, CVE-2026-5885, CVE-2026-5886, CVE-2026-5887, CVE-2026-5888, CVE-2026-5889, CVE-2026-5890, CVE-2026-5891, CVE-2026-5892, CVE-2026-5893, CVE-2026-5894, CVE-2026-5895, CVE-2026-5896, CVE-2026-5897, CVE-2026-5898, CVE-2026-5899, CVE-2026-5900, CVE-2026-5901, CVE-2026-5902, CVE-2026-5903, CVE-2026-5904, CVE-2026-5905, CVE-2026-5906, CVE-2026-5907, CVE-2026-5908, CVE-2026-5909, CVE-2026-5910, CVE-2026-5911, CVE-2026-5912, CVE-2026-5913, CVE-2026-5914, CVE-2026-5915, CVE-2026-5918, CVE-2026-5919

CVE-2020-27844, CVE-2021-21159, CVE-2021-21160, CVE-2021-21161, CVE-2021-21162, CVE-2021-21163, CVE-2021-21164, CVE-2021-21165, CVE-2021-21166, CVE-2021-21167, CVE-2021-21168, CVE-2021-21169, CVE-2021-21170, CVE-2021-21171, CVE-2021-21172, CVE-2021-21173, CVE-2021-21174, CVE-2021-21175, CVE-2021-21176, CVE-2021-21177, CVE-2021-21178, CVE-2021-21179, CVE-2021-21180, CVE-2021-21181, CVE-2021-21182, CVE-2021-21183, CVE-2021-21184, CVE-2021-21185, CVE-2021-21186, CVE-2021-21187, CVE-2021-21188, CVE-2021-21189, CVE-2021-21190

CVE-2018-4117, CVE-2018-6044, CVE-2018-6150, CVE-2018-6151, CVE-2018-6152, CVE-2018-6153, CVE-2018-6154, CVE-2018-6155, CVE-2018-6156, CVE-2018-6157, CVE-2018-6158, CVE-2018-6159, CVE-2018-6160, CVE-2018-6161, CVE-2018-6162, CVE-2018-6163, CVE-2018-6164, CVE-2018-6165, CVE-2018-6166, CVE-2018-6167, CVE-2018-6168, CVE-2018-6169, CVE-2018-6170, CVE-2018-6171, CVE-2018-6172, CVE-2018-6173, CVE-2018-6174, CVE-2018-6175, CVE-2018-6176, CVE-2018-6177, CVE-2018-6178, CVE-2018-6179

chromium -- vulnerabilityentered 2018-04-24

CVE-2018-6084, CVE-2018-6085, CVE-2018-6086, CVE-2018-6087, CVE-2018-6088, CVE-2018-6089, CVE-2018-6090, CVE-2018-6091, CVE-2018-6092, CVE-2018-6093, CVE-2018-6094, CVE-2018-6095, CVE-2018-6096, CVE-2018-6097, CVE-2018-6098, CVE-2018-6099, CVE-2018-6100, CVE-2018-6101, CVE-2018-6102, CVE-2018-6103, CVE-2018-6104, CVE-2018-6105, CVE-2018-6106, CVE-2018-6107, CVE-2018-6108, CVE-2018-6109, CVE-2018-6110, CVE-2018-6111, CVE-2018-6112, CVE-2018-6113, CVE-2018-6114, CVE-2018-6115, CVE-2018-6116, CVE-2018-6117

Problem reports (15) · open in Bugzilla, most recently changed first

PRSummaryStatusChanged
300113maintainer-feedback? www/chromium: hang after selecting a drop-down in chrome browserNew2026-10-27
298960maintainer-feedback? www/chromium 154.0.8037.57 build failureNew2026-10-26
298988maintainer-feedback? www/chromium: chromedriver leaks its listening socket into Chrome; helper processes outlive the browser and keep the port boundNew2026-09-30
298780maintainer-feedback? www/chromium: plist issuesNew2026-09-23
254564maintainer-feedback? www/chromium: wrong dependency to libkrb5Open2026-09-23
Show all 15
PRSummaryStatusChanged
294933maintainer-feedback? www/chromium: re-enable zygotesOpen2026-07-19
269234maintainer-feedback? www/chromium: Sandboxing cleanup and basic Capsicum support for renderer processesNew2026-05-20
292307maintainer-feedback? www/chromium fails to store passwords/autologinNew2026-01-09
292306maintainer-feedback? www/chromium fails to store passwords/autologinNew2026-01-09
291315maintainer-feedback? www/chromium: [Feature Request] Provide chromium alias for Chromium port and clarify executable namingNew2025-12-01
290851maintainer-feedback? www/chromium: emoji picker not workingNew2025-11-07
290718maintainer-feedback? www/chromium: micro stuttering when playing >=1080p60 videosNew2025-11-01
265180maintainer-feedback? www/chromium: actually use the system-installed ICUOpen2025-10-26
278821maintainer-feedback? www/chromium: experiencing audio distortion when using webrtc and Universal Audio Volt 176 interfaceNew2025-09-17
280733maintainer-feedback? www/chromium: web serial api access is disabledNew2024-08-10

Commits (878)

Carlos J. Puga Medina (cpm) · 75.0.3770.100
www/chromium: Update to 75.0.3770.100

Changelog: https://chromium.googlesource.com/chromium/src/+log/75.0.3770.90..75.0.3770.100?pretty=fuller&n=10000
a7097126b3
Jan Beich (jbeich) · 75.0.3770.90_1
multimedia/openh264: update to 2.0.0

- Add symlinks for cliqz and thunderbird

Changes:	https://github.com/cisco/openh264/releases/tag/v2.0.0
ABI:		https://abi-laboratory.pro/tracker/timeline/openh264/
Reported by:	GitHub (watch releases)
edc42f3c38
Carlos J. Puga Medina (cpm) · 75.0.3770.90
www/chromium: Update to 75.0.3770.90

Changelog: https://chromium.googlesource.com/chromium/src/+log/75.0.3770.80..75.0.3770.90?pretty=fuller&n=10000
29ec4e38a9
Carlos J. Puga Medina (cpm) · 75.0.3770.80
www/chromium: Unbreak build on < 11.3

In file included from gen/base/base_jumbo_17.cc:8:
./../../base/sampling_heap_profiler/sampling_heap_profiler.cc:74:3: error: use of undeclared identifier 'pthread_get_name_np'
  pthread_get_name_np(pthread_self(), name, kBufferLen);
  ^

PR:		238563
Reported by:	kib@
077c6a2e18
Carlos J. Puga Medina (cpm) · 75.0.3770.80
www/chromium: Update to 75.0.3770.80

Changelog: https://chromium.googlesource.com/chromium/src/+log/74.0.3729.169..75.0.3770.80?pretty=fuller&n=10000

Submitted by:	Matthias Wolf <matthias@rheinwolf.de>
fde2530e82
Carlos J. Puga Medina (cpm) · 74.0.3729.169
www/chromium: Update to 74.3729.169

Changelog: https://chromium.googlesource.com/chromium/src/+log/74.0.3729.157..74.0.3729.169?pretty=fuller&n=10000
40ee87cc13
Carlos J. Puga Medina (cpm) · 74.0.3729.157_1
- Add an upstream fix for issue 956061: Context menu and on top elements draw a black rectangle.

Read for more details: https://bugs.chromium.org/p/chromium/issues/detail?id=956061
2541c1af71
Rene Ladan (rene) · 74.0.3729.157
www/chromium: update to 74.0.3729.157

Submitted by:	Matthias Wolf via GitHub (#150 #151)
MFH:		2019Q2
a8a9149eb3
Carlos J. Puga Medina (cpm) · 73.0.3683.103_2
www/chromium: Unbreak on arm64

PR:		236441
Submitted by:	Mikael Urankar <mikael.urankar@gmail.com>
MFH:		2019Q2
f50606dbd1
Tobias C. Berner (tcberner) · 73.0.3683.103_1
accessibility/speech-dispatcher: update to 0.8.8
751dfb9495
Carlos J. Puga Medina (cpm) · 73.0.3683.103
www/chromium: Update to 73.0.3683.103

Changelog: https://chromium.googlesource.com/chromium/src/+log/73.0.3683.86..73.0.3683.103?pretty=fuller&n=10000

MFH:		2019Q2
4773406f17
Carlos J. Puga Medina (cpm) · 73.0.3683.86
www/chromium: Update to 73.0.3683.86

- Make existing patches apply cleanly

Changelog: https://chromium.googlesource.com/chromium/src/+log/72.0.3626.121..73.0.3683.86?pretty=fuller&n=10000

Submitted by:	Matthias Wolf
MFH:		2019Q2
d90bf58cf8
Carlos J. Puga Medina (cpm) · 72.0.3626.121_3
www/chromium: fix U2F support

U2F (ie Yubikeys) support was broken in r489612 when part of the required functionality was removed from services/device/hid/hid_connection_freebsd.cc

Submitted patch brings it back and also synchronizes blocking checks API with Linux version of the file.

PR:		236911
Submitted by:	gonzo
fec0107d4f
Jan Beich (jbeich) · 72.0.3626.121_2
devel/icu: update to 64.1

Changes:	http://site.icu-project.org/download/64
ABI:		https://abi-laboratory.pro/tracker/timeline/icu4c/
PR:		236325
Exp-run by:	antoine
Differential Revision:	https://reviews.freebsd.org/D19479
480c577baa
Conrad Meyer (cem) · 72.0.3626.121_1
www/chromium: Remove reference to obsolete FreeBSD

As the removed message says, this has been the default since 11.0. 11.0 itself
is EOL, as is anything older than it.

https://www.freebsd.org/security/index.html#sup

Reviewed by:	cpm
Approved by:	cpm
Differential Revision:	https://reviews.freebsd.org/D19494
2c7f9c2fb2
Sunpoet Po-Chuan Hsieh (sunpoet) · 72.0.3626.121_1
Move x11-fonts/noto-lite to x11-fonts/noto-basic

- Update NotoEmoji-Regular to 1.05uh
- Update MASTER_SITES
- Add NotoColorEmoji
- Update COMMENT
- Add LICENSE_FILE
- Change FONTNAME to noto
- Silence extraction message
- Use PLIST
- Update RUN_DEPENDS of dependent ports
- Bump PORTREVISION of dependent ports for dependency change

Changes:	https://github.com/googlei18n/noto-emoji/commits/master/fonts/NotoEmoji-Regular.ttf
6d17ecbc7f
Carlos J. Puga Medina (cpm) · 72.0.3626.121
www/chromium: Update to 72.0.3626.121

Changelog: https://chromium.googlesource.com/chromium/src/+log/72.0.3626.119..72.0.3626.121?pretty=fuller&n=10000
8506db1777
Rene Ladan (rene) · 72.0.3626.119
www/chromium: use Java for Javascript on i386 too.

Reported by:	pkg-fallout
8a57760cbc
Rene Ladan (rene) · 72.0.3626.119
www/chromium: update to 72.0.3626.119 [1]

PR:		234773
Submitted by:	cpm [1], Matthias Wolf [1]
Obtained from:	https://github.com/cpu82/freebsd-chromium.git
MFH:		2019Q1
a31400d152
Carlos J. Puga Medina (cpm) · 71.0.3578.98_2
- Fix debug build - Add missing patch in r489897 - Drop unnecessary patch - Bump PORTREVISION

MFH:		2019Q1
944c917ce1
Carlos J. Puga Medina (cpm) · 71.0.3578.98_1
- Enable Hangout extension - Fix jumbo build with the SNDIO option enabled [1] - Fix crash in V8 - Fix nav preload with third-party cookie blocking - Backport more patches from OpenBSD chromium port - Bump PORTREVISION

Reported by:	Joseph Mingrone <jrm@FreeBSD.org> via email [1]
MFH:		2019Q1
09d6306d2a
Carlos J. Puga Medina (cpm) · 71.0.3578.98
- Unbreak devel/chromium-gn port

Reported by:	pkg-fallout
MFH:		2019Q1
a1d0461de6
Carlos J. Puga Medina (cpm) · 71.0.3578.98
www/chromium: Update to 71.0.3578.98

Changelog: https://chromium.googlesource.com/chromium/src/+log/68.0.3440.106..71.0.3578.98?pretty=fuller&n=10000

PR:		233990
Submitted by:	Matthias Wolf <freebsd@rheinwolf.de>
Reported by:	nikolaibitinit@gmail.com
Reviewed by:	rene, cpm
Approved by:	rene, cpm
MFH:		2019Q1
Security:	http://vuxml.freebsd.org/freebsd/546d4dd4-10ea-11e9-b407-080027ef1a23.html
Security:	http://vuxml.freebsd.org/freebsd/720590df-10eb-11e9-b407-080027ef1a23.html
ab34cf48c6
Gerald Pfeifer (gerald) · 68.0.3440.106_7
Bump PORTREVISION for ports depending on the canonical version of GCC defined via Mk/bsd.default-versions.mk which has moved from GCC 7.4 t GCC 8.2 under most circumstances.

This includes ports
 - with USE_GCC=yes or USE_GCC=any,
 - with USES=fortran,
 - using Mk/bsd.octave.mk which in turn features USES=fortran, and
 - with USES=compiler specifying openmp, nestedfct, c11, c++0x, c++11-lang,
   c++11-lib, c++14-lang, c++17-lang, or gcc-c++11-lib
plus, as a double check, everything INDEX-11 showed depending on lang/gcc7.

PR:		231590
a9f015d155
Emmanuel Vadot (manu) · 68.0.3440.106_6
www/chromium: Really unbreak on arm64

r486198 didn't include the correct patch for boringssl.
Fix this.

Pointy Hat:	manu
Tested On:	Pinebook

Approved by:	bapt (mentor, implicit)
584e5f37da
Emmanuel Vadot (manu) · 68.0.3440.106_6
www/chromium: Fix build on aarch64

arm64 doesn't have elf_aux_info and FreeBSD doesn't support getauxval.
For both boringssl and zlib disable the feature checking until we have
a way to expose those feature to the user.
Remove a patch (patch-third__party_boringssl_src_crypto_cpu-aarch64-linux.c) which is a no op
as all the code in under OPENSSL_LINUX which isn't defined.

Reviewed by:	cpm (earier version), bapt (earlier version)
Approved by:	bapt (mentor, implicit)
3f1c951210
Emmanuel Vadot (manu) · 68.0.3440.106_6
Revert r485933

It was based on an older version of the port, revert until I work on it again

Approved by:	bapt (mentor, implicit)
1fdf92a957
Emmanuel Vadot (manu) · 68.0.3440.106_6
www/chromium: Fix build on aarch64

arm64 doesn't have elf_aux_info and FreeBSD doesn't support getauxval.
For both boringssl and zlib disable the feature checking until we have
a way to expose those feature to the user.
Remove a patch (patch-third__party_boringssl_src_crypto_cpu-aarch64-linux.c) which is a no op
as all the code in under OPENSSL_LINUX which isn't defined.

Reviewed by:	cpm, bapt
Approved by:	bapt (mentor)
Differential Revision:	https://reviews.freebsd.org/D17207
af155c4db4
Jan Beich (jbeich) · 68.0.3440.106_6
multimedia/ffmpeg: update to 4.1

Changes:	https://git.ffmpeg.org/gitweb/ffmpeg.git/blob/n4.1:/Changelog
ABI:		https://abi-laboratory.pro/tracker/timeline/ffmpeg/
0872f77fd4
Rene Ladan (rene) · 68.0.3440.106_5
Remove compatibility code for FreeBSD < 11.2 from all ports.

Simplify some ports where DragonFlyBSD no longer needs to be special-cased.
Submitted by:	rene
Reviewed by:	bapt, jbeich
Differential Revision:	https://reviews.freebsd.org/D17724
8a502cb2d4
Jan Beich (jbeich) · 68.0.3440.106_5
devel/icu: update to 63.1

Changes:	http://site.icu-project.org/download/63
ABI:		https://abi-laboratory.pro/tracker/timeline/icu4c/
PR:		232300
Exp-run by:	antoine
91f9922c6f
Niclas Zeising (zeising) · 68.0.3440.106_4
Change x11/xorgproto to become a build dep

Change x11/xorgproto to become a build time dependency when added to
USE_XORG.  Change the dependency to be on the port, rather than a file the
port installs.
Fix fallout.
Bump portrevision on depending ports.

PR:		230909
Reviewed by:	eadler
Approved by:	portmgr (antoine)
Obtained from:	https://github.com/FreeBSDDesktop/freebsd-ports/tree/feature/xorgproto
exp-run:	antoine
Differential Revision:	https://reviews.freebsd.org/D16906
0fae2e9e0e
Carlos J. Puga Medina (cpm) · 68.0.3440.106_3
- USE_GNOME also requires USES=gnome - Switch to USES=localbase:ldflags - Revert Makefile.tests and include more *_unittests - Update patch file with missing WEBRTC_BSD macro - Apply several patches from devel/googletest (thanks to jbeich@) - Bump PORTREVISION
2299656dc8
Carlos J. Puga Medina (cpm) · 68.0.3440.106_2
- Add more useful comments to make Makefile more readable - Fix TEST option allow running basic tests and skip tests that must be verified   if they are supported before being added back to TEST_TARGETS - Add patches that fixes crash with non-MESA drivers fall back to scanning PCI   devices. Ideally, we'd like to use libpci but the current version calculates   device class wrong for non-root users

Tested by: Oleh Hushchenkov <gor@clogic.com.ua>, Jonathan Chen <jonc@chen.org.nz>

- Bump PORTREVISION

PR:		230450 [1]
Submitted by:	gonzo [1]
Reported by:	Oleh Hushchenkov, Jonathan Chen [1]
c03810c215
Carlos J. Puga Medina (cpm) · 68.0.3440.106_1
- Cosmetic fix in Makefile - Allow chromium to use the Linux GPU access setup implementation by default since it works correctly - Add missing file for DEBUG option in pkg-plist - Sort pkg-plist - Bump PORTREVISION
9435d9f850
Carlos J. Puga Medina (cpm) · 68.0.3440.106
www/chromium: Update to 68.0.3440.106

- Update amount of free disk space required to build chromium
- Implement GPU access set up for FreeBSD [1]
- Remove the incorrect sugestion in pkg-message and remove the fix-hanging-tabs.sh script because the bug of hanging tabs has been fixed in r337328 improving the chromium stability. Thanks to markj@ [2]

PR:		230450 [1], 212812 [2]
Reported by:	Oleh Hushchenkov <gor@clogic.com.ua>
MFH:		2018Q3
6c568929e0
Carlos J. Puga Medina (cpm) · 68.0.3440.84_1
www/chromium: minor fix in pkg-message

%%DATADIR%% is not being expanded in pkg-message, and it shows up like this:

--II--
Chromium has a known problem of hanging tabs. The workaround
for this problem is to mount ~/.cache/chromium as memory-fs.
In order to do this, before you run Chromium, please run the
following script as root once for each user who uses Chromium
(replace {user}/{group} with your user/group names):

# %%DATADIR%%/fix-hanging-tabs.sh {user} {group}

- Add DATADIR to SUB_LIST to correctly be replaced with its value and move pkg-message to FILESDIR.
- Bump PORTREVISION

Reported by:	olgeni via mail
afe141e079
Carlos J. Puga Medina (cpm) · 68.0.3440.84
www/chromium: Update to 68.0.3440.84

Changelog: https://chromium.googlesource.com/chromium/src/+log/67.0.3396.87..68.0.3440.84?pretty=fuller&n=10000

At the moment pkg-message says that in order to work around the hanging tabs problem the user may wish to run the following commands:

# [ -d ~{user}/.cache/chromium ] || mkdir ~{user}/.cache/chromium
# echo "md $(echo ~{user})/.cache/chromium mfs rw,late,-w{user}:{group},-s300m 2 0" >> /etc/fstab
# mount ~{user}/.cache/chromium

Add fix-hanging-tabs.sh script to the DATADIR [1], which simplifies the process to just running

/usr/local/share/chromium/fix-hanging-tabs.sh $user $group

PR:		230264 [1]
Submitted by:	0mp [1]
MFH:		2018Q3
Security:	http://vuxml.freebsd.org/freebsd/b9c525d9-9198-11e8-beba-080027ef1a23.html
7636049649
Niclas Zeising (zeising) · 67.0.3396.87_1
Switch to xorgproto instead of individual packages

Upstream used to distribute protocol headers as separate packages, but has
decided to merge those to a common package, named xorgproto.  This update
tracks that change.

* Add a new port, x11/xorgproto, with are protocol headers for xorg.
* Hook the new protocol port to the build and to infrastructure in
  bsd.xorg.mk.
* Update all ports with a dependency on any of the old *proto packages to
  instead depend on xorgproto.  Bump portrevision.
* Delete the old *proto packages, update MOVED.

PR:		230023
Submitted by:	zeising
Approved by:	portmgr (antoine)
exp-run by:	antoine
15dac70c75
Carlos J. Puga Medina (cpm) · 67.0.3396.87
Put the git dependency in the right place. Now chromedriver needs git dependency at build time.

Don't bump PORTREVISION because DRIVER option is enabled by default and does not affect to the generated package.

Reported by:	Claude Buisson <clbuisson@orange.fr>
MFH:		2018Q3 (blanket)
8684fe7e9e
Carlos J. Puga Medina (cpm) · 67.0.3396.87
www/chromium: update to 67.0.3396.87

Changelog: https://chromium.googlesource.com/chromium/src/+log/65.0.3325.181..67.0.3396.87?pretty=fuller&n=10000

MFH:		2018Q3
Security:	https://vuxml.freebsd.org/freebsd/36ff7a74-47b1-11e8-a7d6-54e1ad544088.html
Security:	https://vuxml.freebsd.org/freebsd/006bee4e-4c49-11e8-9c32-54ee754af08e.html
Security:	https://vuxml.freebsd.org/freebsd/e457978b-5484-11e8-9b85-54ee754af08e.html
Security:	https://vuxml.freebsd.org/freebsd/427b0f58-644c-11e8-9e1b-e8e0b747a45a.html
Security:	https://vuxml.freebsd.org/freebsd/4cb49a23-6c89-11e8-8b33-e8e0b747a45a.html
87e53bd878
Jan Beich (jbeich) · 65.0.3325.181_6
devel/icu: update to 62.1

Changes:	http://site.icu-project.org/download/62
ABI:		https://abi-laboratory.pro/tracker/timeline/icu4c/
PR:		229359
Exp-run by:	antoine (only 10.4)
3beb732dad
Carlos J. Puga Medina (cpm) · 65.0.3325.181_5
- Add patch to build chromium with native LLVM 6.0 on FreeBSD >= 1101513 - Disable use_gold flag. If lld is disabled, chromium uses the gold linker instead of lld of bfd. We do not want this to happen. - Bump PORTREVISION
b46d30b601
Jan Beich (jbeich) · 65.0.3325.181_4
Drop FreeBSD 10.3 support

Reviewed by:	yuri (SoPlex), sunpoet (nghttp2), cpm (chromium), brooks (llvm*)
Approved by:	portmgr (rene)
Differential Revision:	https://reviews.freebsd.org/D15238
67a9073255
Jan Beich (jbeich) · 65.0.3325.181_4
multimedia/ffmpeg: update to 4.0

- FFSERVER support was removed upstream
- libressl now uses libtls backend instead of patching openssl one
- Clang i386 no longer uses 16-byte aligned stack

Changes:	https://git.ffmpeg.org/gitweb/ffmpeg.git/blob/n4.0:/Changelog
ABI:		https://abi-laboratory.pro/tracker/timeline/ffmpeg/
PR:		227726
Exp-run by:	antoine
Differential Revision:	https://reviews.freebsd.org/D15175
c400a2c8b6
Carlos J. Puga Medina (cpm) · 65.0.3325.181_3
www/chromium: switch to llvm60

PR:		227683
Submitted by:	jbeich
8768d9b13a
Jan Beich (jbeich) · 65.0.3325.181_2
www/chromium: unbreak with ffmpeg 4.0

../../media/ffmpeg/ffmpeg_common.cc:36:1: error: static_assert failed "DecoderBuffer padding size does not fit ffmpeg requirement"
static_assert(DecoderBuffer::kPaddingSize >= AV_INPUT_BUFFER_PADDING_SIZE,
^             ~~~~~~~~~~~~~~~~~~~~~~~~~~~~~~~~~~~~~~~~~~~~~~~~~~~~~~~~~~~

PR:		227726
Obtained from:	upstream
039768d14f
Carlos J. Puga Medina (cpm) · 65.0.3325.181_1
www/chromium: Unbreak build on 12/aarch64

../../third_party/skia/src/core/SkCpu.cpp:84:27: error: use of undeclared identifier 'getauxval'
        uint32_t hwcaps = getauxval(AT_HWCAP);
                          ^

PR:		224383
Submitted by:	Mikael Urankar <mikael.urankar@gmail.com>
Reported by:	jbeich
7a827ec156
Carlos J. Puga Medina (cpm) · 65.0.3325.181_1
- Remove duplicate dependency libxml2

While I'm here remove comment about use_system_icu because it is already unbundled.

MFH:		2018Q2 (blanket)
d7f6b13c49
Jan Beich (jbeich) · 65.0.3325.181_1
devel/icu: update to 61.1

Changes:	http://site.icu-project.org/download/61
ABI:		https://abi-laboratory.pro/tracker/timeline/icu4c/
PR:		227042
Exp-run by:	antoine
MFH:		2018Q2 (required by Firefox 61)
ae60358af5