CVE and update status of the FreeBSD ports tree3,312 unaddressed CVEs in 679 portsAll times are CET
Port details

www/chromium 156.0.8078.47_1

Google web browser based on WebKit

Port info

Maintainer
chromium@FreeBSD.org
Packages
latest: 156.0.8078.47_1
Upstream
up to date
Last update
to 156.0.8078.47_1 · f573466189
Quarterly
not in the 2026Q4 packages
WWW
https://www.chromium.org/Home
Links
cgit · VuXML · Report wrong data

Install

Package
# pkg install chromium
installs 156.0.8078.47_1 from latest
Port
# cd /usr/ports/www/chromium && make install clean
# make -C /usr/ports/www/chromium config  # change options first
Size
147 MiB download · 518 MiB installed
Depends on
accessibility/at-spi2-core 2.60.4, accessibility/speech-dispatcher 0.12.1_1, audio/alsa-lib 1.2.16.1, audio/alsa-plugins 1.2.12_2, audio/flac 1.5.0,1, audio/opus 1.6.1, audio/sndio 1.10.0_1, audio/speex 1.2.1_1,1, converters/libiconv 1.18_1, devel/dbus 1.16.2_4,1, devel/dbus-glib 0.116, devel/dconf 0.49.0, devel/desktop-file-utils 0.28, devel/gettext-runtime 1.0_1, devel/glib20 2.88.3,2, devel/icu 76.1,1, devel/jsoncpp 1.9.8, devel/libepoll-shim 0.0.20240608, devel/libevent 2.1.13, devel/libffi 3.8.0, devel/libpci 3.15.0, devel/nspr 4.39, devel/re2 20251105, devel/xdg-utils 1.2.1, graphics/cairo 1.18.2,3, graphics/gdk-pixbuf2 2.44.1, graphics/jpeg-turbo 3.1.4.1, graphics/libdrm 2.4.134,1, graphics/libexif 0.6.26, graphics/libglvnd 1.7.0, graphics/mesa-libs 26.2.2_1, graphics/png 1.6.59_1, graphics/wayland 1.26.0, graphics/webp 1.6.0, multimedia/dav1d 1.5.4, multimedia/openh264 2.6.0_1,2, multimedia/pipewire 1.6.9, print/cups 2.4.20, print/freetype2 2.14.3, print/harfbuzz 14.6.0, print/harfbuzz-icu 14.6.0, security/libgcrypt 1.12.4, security/libsecret 0.21.7_2, security/nss 3.131.1, textproc/expat2 2.9.0, textproc/libxml2 2.15.4, textproc/libxslt 1.1.45, x11-fonts/fontconfig 2.18.3,1, x11-fonts/noto-basic 2.0_4, x11-toolkits/gtk30 3.24.52, x11-toolkits/pango 1.57.1, x11/libX11 1.8.14,1, x11/libXScrnSaver 1.2.5, x11/libXcomposite 0.4.7,1, x11/libXcursor 1.2.3, x11/libXdamage 1.1.7, x11/libXext 1.3.7,1, x11/libXfixes 6.0.2, x11/libXi 1.8.4,1, x11/libXrandr 1.5.5, x11/libXrender 0.9.13, x11/libXtst 1.2.6, x11/libxcb 1.17.0, x11/libxkbcommon 1.13.2, x11/libxshmfence 1.3.3
License
BSD3CLAUSE and LGPL21 and MPL11
Options
8 of 15 on in the package: ALSA CODECS CUPS DRIVER KERBEROS PIPEWIRE PULSEAUDIO SNDIO
Show the 7 options that are off
DEBUG HEIMDAL HEIMDAL_BASE LTO MIT TEST WIDEVINE

Packages by version and architecture

latest

FreeBSD versionamd64aarch64i386
FreeBSD 16✗✗–
FreeBSD 15156.0.8078.47_1✗–
FreeBSD 14✗✗✗

quarterly (2026Q4)

FreeBSD versionamd64aarch64i386
FreeBSD 15✗✗–
FreeBSD 14✗✗✗

version as in the ports tree (latest) or the most common one (quarterly) · different version · ✗ not built · – no packages for this platform. Package sets that have not been rebuilt for 60 days are left out.

Unaddressed and VuXML only (0)

No unaddressed CVE and nothing reported by pkg audit for the packaged version 156.0.8078.47_1.

Fixed (656)

Show 656 fixed
VuXML entries whose affected range the packaged version has left, plus CVEs whose record still lists this version although VuXML considers them fixed (usually a backported fix), plus CVEs from the last 90 days that this version is already past (fixed by update).
CVECVSSPublishedDescription
CVE-2026-1133448.82026-10-20VuXML · Use after free in Performance in Google Chrome prior to 156.0.8078.47 allowed a remote attacker to execute arbitrary code inside the sandbox via a crafted HTML page. (Ch…
CVECVSSPublishedDescription
CVE-2026-1133369.62026-10-20Memory corruption in Compositing in Google Chrome prior to 156.0.8078.47 allowed a remote attacker to potentially execute arbitrary code outside the sandbox via a crafte…
CVE-2026-1133429.62026-10-20Memory corruption in Network in Google Chrome prior to 156.0.8078.47 allowed a remote attacker to execute arbitrary code outside the sandbox via a crafted HTML page. (Ch…
CVE-2026-1133289.62026-10-20Improper input validation in Privacy in Google Chrome prior to 156.0.8078.47 allowed a remote attacker to potentially execute arbitrary code outside the sandbox via a cr…
CVE-2026-1133009.62026-10-20Out of bounds write in Forms in Google Chrome prior to 156.0.8078.47 allowed a remote attacker to potentially execute arbitrary code outside the sandbox via a crafted HT…
CVE-2026-1132839.62026-10-20Memory corruption in CredentialProvider in Google Chrome on on Windows prior to 156.0.8078.47 allowed a remote attacker to potentially execute arbitrary code outside the…
CVE-2026-1132639.62026-10-20Use after free in Core in Google Chrome on on Android prior to 156.0.8078.47 allowed a remote attacker to potentially execute arbitrary code outside the sandbox via a cr…
CVE-2026-1132709.62026-10-20Use after free in Internals in Google Chrome prior to 156.0.8078.47 allowed a remote attacker to execute arbitrary code outside the sandbox via a crafted HTML page. (Chr…
CVE-2026-1132619.62026-10-20Use after free in WebAppInstalls in Google Chrome prior to 156.0.8078.47 allowed a remote attacker to potentially execute arbitrary code outside the sandbox via a crafte…
CVE-2026-1132529.62026-10-20Improper input validation in ANGLE in Google Chrome on on Windows prior to 156.0.8078.47 allowed a remote attacker to potentially execute arbitrary code outside the sand…
CVE-2026-1132359.62026-10-20Improper input validation in Passwords in Google Chrome prior to 156.0.8078.47 allowed a remote attacker to potentially execute arbitrary code outside the sandbox via a …
CVE-2026-1132229.62026-10-20Use after free in V8 in Google Chrome prior to 156.0.8078.47 allowed a remote attacker to potentially execute arbitrary code outside the sandbox via a crafted HTML page.…
CVE-2026-1132119.62026-10-20Memory corruption in ServiceWorker in Google Chrome prior to 156.0.8078.47 allowed a remote attacker to potentially execute arbitrary code outside the sandbox via a craf…
CVE-2026-1131869.62026-10-20Memory corruption in DevTools in Google Chrome prior to 156.0.8078.47 allowed a remote attacker to execute arbitrary code outside the sandbox via a crafted HTML page. (C…
CVE-2026-1131899.62026-10-20Use after free in Core in Google Chrome prior to 156.0.8078.47 allowed a remote attacker to execute arbitrary code outside the sandbox via a crafted HTML page. (Chromium…
CVE-2026-1131699.62026-10-20Memory corruption in WebAppInstalls in Google Chrome on on Android prior to 156.0.8078.47 allowed a remote attacker to execute arbitrary code outside the sandbox via a c…
CVE-2026-1131719.62026-10-20Memory corruption in Prompts in Google Chrome on on Android prior to 156.0.8078.47 allowed a remote attacker to potentially execute arbitrary code outside the sandbox vi…
CVE-2026-1131389.62026-10-20Memory corruption in WebAppInstalls in Google Chrome prior to 156.0.8078.47 allowed a remote attacker to potentially execute arbitrary code outside the sandbox via a cra…
CVE-2026-1131269.62026-10-20Memory corruption in PolicyContainer in Google Chrome prior to 156.0.8078.47 allowed a remote attacker to potentially execute arbitrary code outside the sandbox via a cr…
CVE-2026-1131169.62026-10-20Use after free in DevTools in Google Chrome prior to 156.0.8078.47 allowed a remote attacker to potentially execute arbitrary code outside the sandbox via a crafted HTML…
CVE-2026-1130849.62026-10-20Improper input validation in Permissions in Google Chrome prior to 156.0.8078.47 allowed a remote attacker to potentially execute arbitrary code outside the sandbox via …
CVE-2026-1130899.62026-10-20Improper input validation in PrintPreview in Google Chrome prior to 156.0.8078.47 allowed a remote attacker to potentially execute arbitrary code outside the sandbox via…
CVE-2026-1130729.62026-10-20Memory corruption in CSS in Google Chrome prior to 156.0.8078.47 allowed a remote attacker to potentially execute arbitrary code outside the sandbox via a crafted HTML p…
CVE-2026-1130569.62026-10-20Memory corruption in PerformanceAPIs in Google Chrome prior to 156.0.8078.47 allowed a remote attacker to potentially execute arbitrary code outside the sandbox via a cr…
CVE-2026-1130239.62026-10-20Improper input validation in Extensions in Google Chrome prior to 156.0.8078.47 allowed a remote attacker to potentially execute arbitrary code outside the sandbox via a…
CVE-2026-1130149.62026-10-20Use after free in PerformanceAPIs in Google Chrome prior to 156.0.8078.47 allowed a remote attacker to potentially execute arbitrary code outside the sandbox via a craft…
CVE-2026-1130209.62026-10-20Improper input validation in Date in Google Chrome prior to 156.0.8078.47 allowed a remote attacker to potentially execute arbitrary code outside the sandbox via a craft…
CVE-2026-1130079.62026-10-20Memory corruption in Permissions in Google Chrome prior to 156.0.8078.47 allowed a remote attacker to potentially execute arbitrary code outside the sandbox via a crafte…
CVE-2026-1129929.62026-10-20Memory corruption in Canvas in Google Chrome prior to 156.0.8078.47 allowed a remote attacker to potentially execute arbitrary code outside the sandbox via a crafted HTM…
CVE-2026-1130789.62026-10-20Improper input validation in Compositing in Google Chrome prior to 156.0.8078.47 allowed a remote attacker to potentially execute arbitrary code outside the sandbox via …
CVE-2026-1133438.82026-10-20Memory corruption in Sandbox in Google Chrome prior to 156.0.8078.47 allowed a remote attacker to execute arbitrary code inside the sandbox via a crafted HTML page. (Chr…
CVE-2026-1133358.82026-10-20Memory corruption in Extensions in Google Chrome prior to 156.0.8078.47 allowed a remote attacker to execute arbitrary code inside the sandbox via a crafted HTML page. (…
CVE-2026-1133378.82026-10-20Memory corruption in Scroll in Google Chrome prior to 156.0.8078.47 allowed a remote attacker to execute arbitrary code inside the sandbox via a crafted HTML page. (Chro…
CVE-2026-1133388.82026-10-20Use after free in Turbolev in Google Chrome prior to 156.0.8078.47 allowed a remote attacker to execute arbitrary code inside the sandbox via a crafted HTML page. (Chrom…
CVE-2026-1133398.82026-10-20Use after free in SVG in Google Chrome prior to 156.0.8078.47 allowed a remote attacker to execute arbitrary code inside the sandbox via a crafted HTML page. (Chromium s…
CVE-2026-1133278.82026-10-20Use after free in Chromecast in Google Chrome prior to 156.0.8078.47 allowed a remote attacker to execute arbitrary code inside the sandbox via a crafted HTML page. (Chr…
CVE-2026-1133308.82026-10-20Memory corruption in CustomTabs in Google Chrome on on Android prior to 156.0.8078.47 allowed a remote attacker to potentially execute arbitrary code inside the sandbox …
CVE-2026-1133318.82026-10-20Memory corruption in Controls in Google Chrome prior to 156.0.8078.47 allowed a remote attacker to potentially execute arbitrary code inside the sandbox via a crafted HT…
CVE-2026-1133328.82026-10-20Memory corruption in GPU in Google Chrome prior to 156.0.8078.47 allowed a remote attacker to execute arbitrary code inside the sandbox via a crafted HTML page. (Chromiu…
CVE-2026-1133348.82026-10-20Improper input validation in ANGLE in Google Chrome on on Windows prior to 156.0.8078.47 allowed a remote attacker to potentially execute arbitrary code inside the sandb…
CVE-2026-1133178.82026-10-20Memory corruption in Accessibility in Google Chrome on on Mac prior to 156.0.8078.47 allowed a remote attacker to potentially execute arbitrary code inside the sandbox v…
CVE-2026-1133188.82026-10-20Memory corruption in ServiceWorker in Google Chrome prior to 156.0.8078.47 allowed a remote attacker to execute arbitrary code inside the sandbox via a crafted HTML page…
CVE-2026-1133198.82026-10-20Use after free in Accessibility in Google Chrome prior to 156.0.8078.47 allowed a remote attacker to execute arbitrary code inside the sandbox via a crafted HTML page. (…
CVE-2026-1133208.82026-10-20Memory corruption in Navigation in Google Chrome on on iOS prior to 156.0.8078.47 allowed a remote attacker to potentially execute arbitrary code inside the sandbox via …
CVE-2026-1133218.82026-10-20Use after free in Extensions in Google Chrome prior to 156.0.8078.47 allowed a remote attacker to execute arbitrary code inside the sandbox via a crafted HTML page. (Chr…
CVE-2026-1133238.82026-10-20Use after free in Chrome for iOS in Google Chrome on on iOS prior to 156.0.8078.47 allowed a remote attacker to potentially execute arbitrary code inside the sandbox via…
CVE-2026-1133248.82026-10-20Use after free in GPU in Google Chrome prior to 156.0.8078.47 allowed a remote attacker to execute arbitrary code inside the sandbox via a crafted HTML page. (Chromium s…
CVE-2026-1133088.82026-10-20Use after free in Core in Google Chrome prior to 156.0.8078.47 allowed a remote attacker to execute arbitrary code inside the sandbox via a crafted HTML page. (Chromium …
CVE-2026-1133118.82026-10-20Use after free in ServiceWorker in Google Chrome prior to 156.0.8078.47 allowed a remote attacker to execute arbitrary code inside the sandbox via a crafted HTML page. (…
CVE-2026-1133128.82026-10-20Memory corruption in Autofill in Google Chrome on on Mac prior to 156.0.8078.47 allowed a remote attacker to potentially execute arbitrary code inside the sandbox via a …
CVE-2026-1133138.82026-10-20Memory corruption in DevTools in Google Chrome prior to 156.0.8078.47 allowed a remote attacker to potentially execute arbitrary code inside the sandbox via a crafted HT…
CVE-2026-1133148.82026-10-20Use after free in Media in Google Chrome prior to 156.0.8078.47 allowed a remote attacker to execute arbitrary code inside the sandbox via a crafted HTML page. (Chromium…
CVE-2026-1133158.82026-10-20Memory corruption in ANGLE in Google Chrome prior to 156.0.8078.47 allowed a remote attacker to potentially execute arbitrary code inside the sandbox via a crafted HTML …
CVE-2026-1133168.82026-10-20Improper input validation in Views in Google Chrome prior to 156.0.8078.47 allowed a remote attacker to execute arbitrary code inside the sandbox via a crafted HTML page…
CVE-2026-1132998.82026-10-20Memory corruption in WebProtect in Google Chrome prior to 156.0.8078.47 allowed a remote attacker to potentially execute arbitrary code inside the sandbox via a crafted …
CVE-2026-1133018.82026-10-20Memory corruption in WebAppInstalls in Google Chrome prior to 156.0.8078.47 allowed a remote attacker to potentially execute arbitrary code inside the sandbox via a craf…
CVE-2026-1133028.82026-10-20Use after free in Extensions in Google Chrome prior to 156.0.8078.47 allowed a remote attacker to execute arbitrary code inside the sandbox via a crafted HTML page. (Chr…
CVE-2026-1133038.82026-10-20Memory corruption in WebRTC in Google Chrome prior to 156.0.8078.47 allowed a remote attacker to potentially execute arbitrary code inside the sandbox via a crafted HTML…
CVE-2026-1133058.82026-10-20Use after free in Privacy in Google Chrome prior to 156.0.8078.47 allowed a remote attacker to execute arbitrary code inside the sandbox via a crafted HTML page. (Chromi…
CVE-2026-1133068.82026-10-20Improper input validation in Network in Google Chrome prior to 156.0.8078.47 allowed a remote attacker to potentially execute arbitrary code inside the sandbox via a cra…
CVE-2026-1133078.82026-10-20Memory corruption in Extensions in Google Chrome prior to 156.0.8078.47 allowed a remote attacker to execute arbitrary code inside the sandbox via a crafted HTML page. (…
CVE-2026-1132908.82026-10-20Use after free in Input in Google Chrome prior to 156.0.8078.47 allowed a remote attacker to potentially execute arbitrary code inside the sandbox via a crafted HTML pag…
CVE-2026-1132918.82026-10-20Memory corruption in FullScreen in Google Chrome prior to 156.0.8078.47 allowed a remote attacker to potentially execute arbitrary code inside the sandbox via a crafted …
CVE-2026-1132928.82026-10-20Improper input validation in Omnibox in Google Chrome on on Android prior to 156.0.8078.47 allowed a remote attacker to potentially execute arbitrary code inside the san…
CVE-2026-1132938.82026-10-20Use after free in ANGLE in Google Chrome on on Windows prior to 156.0.8078.47 allowed a remote attacker to execute arbitrary code inside the sandbox via a crafted HTML p…
CVE-2026-1132948.82026-10-20Improper input validation in Loader in Google Chrome prior to 156.0.8078.47 allowed a remote attacker to potentially execute arbitrary code inside the sandbox via a craf…
CVE-2026-1132988.82026-10-20Use after free in Transactions Platform in Google Chrome prior to 156.0.8078.47 allowed a remote attacker to execute arbitrary code inside the sandbox via a crafted HTML…
CVE-2026-1132818.82026-10-20Memory corruption in SiteIsolation in Google Chrome prior to 156.0.8078.47 allowed a remote attacker to potentially execute arbitrary code inside the sandbox via a craft…
CVE-2026-1132828.82026-10-20Use after free in Views in Google Chrome on on Mac prior to 156.0.8078.47 allowed a remote attacker to potentially execute arbitrary code inside the sandbox via a crafte…
CVE-2026-1132848.82026-10-20Memory corruption in XML in Google Chrome prior to 156.0.8078.47 allowed a remote attacker to potentially execute arbitrary code inside the sandbox via a crafted HTML pa…
CVE-2026-1132858.82026-10-20Memory corruption in ANGLE in Google Chrome on on Windows prior to 156.0.8078.47 allowed a remote attacker to execute arbitrary code inside the sandbox via a crafted HTM…
CVE-2026-1132868.82026-10-20Memory corruption in Google Lens in Google Chrome prior to 156.0.8078.47 allowed a remote attacker to execute arbitrary code inside the sandbox via a crafted HTML page. …
CVE-2026-1132878.82026-10-20Use after free in Prompts in Google Chrome prior to 156.0.8078.47 allowed a remote attacker to execute arbitrary code inside the sandbox via a crafted HTML page. (Chromi…
CVE-2026-1132888.82026-10-20Memory corruption in Core in Google Chrome prior to 156.0.8078.47 allowed a remote attacker to execute arbitrary code inside the sandbox via a crafted HTML page. (Chromi…
CVE-2026-1132898.82026-10-20Improper input validation in PerformanceAPIs in Google Chrome prior to 156.0.8078.47 allowed a remote attacker to potentially execute arbitrary code inside the sandbox v…
CVE-2026-1132728.82026-10-20Memory corruption in Extensions in Google Chrome prior to 156.0.8078.47 allowed a remote attacker to potentially execute arbitrary code inside the sandbox via a crafted …
CVE-2026-1132738.82026-10-20Memory corruption in ANGLE in Google Chrome prior to 156.0.8078.47 allowed a remote attacker to execute arbitrary code inside the sandbox via a crafted HTML page. (Chrom…
CVE-2026-1132748.82026-10-20Use after free in ReadingMode in Google Chrome prior to 156.0.8078.47 allowed a remote attacker to execute arbitrary code inside the sandbox via a crafted HTML page. (Ch…
CVE-2026-1132758.82026-10-20Use after free in API in Google Chrome prior to 156.0.8078.47 allowed a remote attacker to execute arbitrary code inside the sandbox via a crafted HTML page. (Chromium s…
CVE-2026-1132768.82026-10-20Memory corruption in Passwords in Google Chrome on on Android prior to 156.0.8078.47 allowed a remote attacker to potentially execute arbitrary code inside the sandbox v…
CVE-2026-1132788.82026-10-20Use after free in Extensions in Google Chrome prior to 156.0.8078.47 allowed a remote attacker to execute arbitrary code inside the sandbox via a crafted HTML page. (Chr…
CVE-2026-1132798.82026-10-20Memory corruption in Accessibility in Google Chrome prior to 156.0.8078.47 allowed a remote attacker to potentially execute arbitrary code inside the sandbox via a craft…
CVE-2026-1132808.82026-10-20Memory corruption in Paint in Google Chrome prior to 156.0.8078.47 allowed a remote attacker to execute arbitrary code inside the sandbox via a crafted HTML page. (Chrom…
CVE-2026-1132648.82026-10-20Improper input validation in Extensions in Google Chrome prior to 156.0.8078.47 allowed a remote attacker to potentially execute arbitrary code inside the sandbox via a …
CVE-2026-1132658.82026-10-20Memory corruption in BFCache in Google Chrome prior to 156.0.8078.47 allowed a remote attacker to potentially execute arbitrary code inside the sandbox via a crafted HTM…
CVE-2026-1132668.82026-10-20Memory corruption in ANGLE in Google Chrome on on Android prior to 156.0.8078.47 allowed a remote attacker to potentially execute arbitrary code inside the sandbox via a…
CVE-2026-1132678.82026-10-20Memory corruption in Video in Google Chrome prior to 156.0.8078.47 allowed a remote attacker to potentially execute arbitrary code inside the sandbox via a crafted HTML …
CVE-2026-1132688.82026-10-20Memory corruption in Navigation in Google Chrome on on iOS prior to 156.0.8078.47 allowed a remote attacker to execute arbitrary code inside the sandbox via a crafted HT…
CVE-2026-1132698.82026-10-20Memory corruption in BrowserTag in Google Chrome prior to 156.0.8078.47 allowed a remote attacker to potentially execute arbitrary code inside the sandbox via a crafted …
CVE-2026-1132718.82026-10-20Use after free in Accessibility in Google Chrome prior to 156.0.8078.47 allowed a remote attacker to execute arbitrary code inside the sandbox via a crafted HTML page. (…
CVE-2026-1132548.82026-10-20Memory corruption in DevTools in Google Chrome prior to 156.0.8078.47 allowed a remote attacker to potentially execute arbitrary code inside the sandbox via a crafted HT…
CVE-2026-1132558.82026-10-20Use after free in CustomTabs in Google Chrome on on Android prior to 156.0.8078.47 allowed a remote attacker to execute arbitrary code inside the sandbox via a crafted H…
CVE-2026-1132568.82026-10-20Use after free in Permissions in Google Chrome prior to 156.0.8078.47 allowed a remote attacker to execute arbitrary code inside the sandbox via a crafted HTML page. (Ch…
CVE-2026-1132578.82026-10-20Memory corruption in Media in Google Chrome prior to 156.0.8078.47 allowed a remote attacker to potentially execute arbitrary code inside the sandbox via a crafted HTML …
CVE-2026-1132588.82026-10-20Memory corruption in Chromoting in Google Chrome prior to 156.0.8078.47 allowed a remote attacker to potentially execute arbitrary code inside the sandbox via a crafted …
CVE-2026-1132598.82026-10-20Use after free in Frames in Google Chrome prior to 156.0.8078.47 allowed a remote attacker to execute arbitrary code inside the sandbox via a crafted HTML page. (Chromiu…
CVE-2026-1132608.82026-10-20Memory corruption in Core in Google Chrome prior to 156.0.8078.47 allowed a remote attacker to potentially execute arbitrary code inside the sandbox via a crafted HTML p…
CVE-2026-1132628.82026-10-20Use after free in Extensions in Google Chrome prior to 156.0.8078.47 allowed a remote attacker to potentially execute arbitrary code inside the sandbox via a crafted HTM…
CVE-2026-1132458.82026-10-20Memory corruption in DevTools in Google Chrome prior to 156.0.8078.47 allowed a remote attacker to execute arbitrary code inside the sandbox via a crafted HTML page. (Ch…
CVE-2026-1132478.82026-10-20Memory corruption in DevTools in Google Chrome prior to 156.0.8078.47 allowed a remote attacker to execute arbitrary code inside the sandbox via a crafted HTML page. (Ch…
CVE-2026-1132488.82026-10-20Memory corruption in FileSystem in Google Chrome prior to 156.0.8078.47 allowed a remote attacker to potentially execute arbitrary code inside the sandbox via a crafted …
CVE-2026-1132498.82026-10-20Improper input validation in Mobile in Google Chrome on on iOS prior to 156.0.8078.47 allowed a remote attacker to potentially execute arbitrary code inside the sandbox …
CVE-2026-1132508.82026-10-20Use after free in ANGLE in Google Chrome prior to 156.0.8078.47 allowed a remote attacker to potentially execute arbitrary code inside the sandbox via a crafted HTML pag…
CVE-2026-1132518.82026-10-20Use after free in PDF in Google Chrome prior to 156.0.8078.47 allowed a remote attacker to execute arbitrary code inside the sandbox via a crafted HTML page. (Chromium s…
CVE-2026-1132538.82026-10-20Use after free in Canvas in Google Chrome prior to 156.0.8078.47 allowed a remote attacker to execute arbitrary code inside the sandbox via a crafted HTML page. (Chromiu…
CVE-2026-1132388.82026-10-20Memory corruption in CustomTabs in Google Chrome on on Android prior to 156.0.8078.47 allowed a remote attacker to potentially execute arbitrary code inside the sandbox …
CVE-2026-1132398.82026-10-20Range error in SiteIsolation in Google Chrome on on Android prior to 156.0.8078.47 allowed a remote attacker to execute arbitrary code inside the sandbox via a crafted H…
CVE-2026-1132408.82026-10-20Use after free in Chromecast in Google Chrome prior to 156.0.8078.47 allowed a remote attacker to potentially execute arbitrary code inside the sandbox via a crafted HTM…
CVE-2026-1132418.82026-10-20Memory corruption in Toolbar in Google Chrome on on Android prior to 156.0.8078.47 allowed a remote attacker to potentially execute arbitrary code inside the sandbox via…
CVE-2026-1132428.82026-10-20Memory corruption in ANGLE in Google Chrome on on Windows prior to 156.0.8078.47 allowed a remote attacker to execute arbitrary code inside the sandbox via a crafted HTM…
CVE-2026-1132438.82026-10-20Memory corruption in DOM in Google Chrome prior to 156.0.8078.47 allowed a remote attacker to potentially execute arbitrary code inside the sandbox via a crafted HTML pa…
CVE-2026-1132448.82026-10-20Improper input validation in UI in Google Chrome prior to 156.0.8078.47 allowed a remote attacker to potentially execute arbitrary code inside the sandbox via a crafted …
CVE-2026-1132288.82026-10-20Use after free in Network in Google Chrome prior to 156.0.8078.47 allowed a remote attacker to execute arbitrary code inside the sandbox via a crafted HTML page. (Chromi…
CVE-2026-1132298.82026-10-20Use after free in Loader in Google Chrome prior to 156.0.8078.47 allowed a remote attacker to execute arbitrary code inside the sandbox via a crafted HTML page. (Chromiu…
CVE-2026-1132308.82026-10-20Improper input validation in Browser in Google Chrome prior to 156.0.8078.47 allowed a remote attacker to potentially execute arbitrary code inside the sandbox via a cra…
CVE-2026-1132318.82026-10-20Improper input validation in Extensions in Google Chrome prior to 156.0.8078.47 allowed a remote attacker to potentially execute arbitrary code inside the sandbox via a …
CVE-2026-1132328.82026-10-20Memory corruption in Search in Google Chrome prior to 156.0.8078.47 allowed a remote attacker to potentially execute arbitrary code inside the sandbox via a crafted HTML…
CVE-2026-1132338.82026-10-20Out of bounds read in Core in Google Chrome on on Android prior to 156.0.8078.47 allowed a remote attacker to potentially execute arbitrary code inside the sandbox via a…
CVE-2026-1132348.82026-10-20Memory corruption in ANGLE in Google Chrome prior to 156.0.8078.47 allowed a remote attacker to potentially execute arbitrary code inside the sandbox via a crafted HTML …
CVE-2026-1132368.82026-10-20Use after free in Navigation in Google Chrome on on iOS prior to 156.0.8078.47 allowed a remote attacker to execute arbitrary code inside the sandbox via a crafted HTML …
CVE-2026-1132188.82026-10-20Use after free in DataTransfer in Google Chrome prior to 156.0.8078.47 allowed a remote attacker to execute arbitrary code inside the sandbox via a crafted HTML page. (C…
CVE-2026-1132198.82026-10-20Memory corruption in Contacts in Google Chrome prior to 156.0.8078.47 allowed a remote attacker to execute arbitrary code inside the sandbox via a crafted HTML page. (Ch…
CVE-2026-1132218.82026-10-20Use after free in Google Lens in Google Chrome prior to 156.0.8078.47 allowed a remote attacker to execute arbitrary code inside the sandbox via a crafted HTML page. (Ch…
CVE-2026-1132268.82026-10-20Memory corruption in Model in Google Chrome prior to 156.0.8078.47 allowed a remote attacker to execute arbitrary code inside the sandbox via a crafted HTML page. (Chrom…
CVE-2026-1132278.82026-10-20Use after free in Editing in Google Chrome prior to 156.0.8078.47 allowed a remote attacker to execute arbitrary code inside the sandbox via a crafted HTML page. (Chromi…
CVE-2026-1132108.82026-10-20Use after free in ANGLE in Google Chrome on on Windows prior to 156.0.8078.47 allowed a remote attacker to execute arbitrary code inside the sandbox via a crafted HTML p…
CVE-2026-1132138.82026-10-20Memory corruption in DevTools in Google Chrome prior to 156.0.8078.47 allowed a remote attacker to execute arbitrary code inside the sandbox via a crafted HTML page. (Ch…
CVE-2026-1132148.82026-10-20Improper input validation in FullScreen in Google Chrome prior to 156.0.8078.47 allowed a remote attacker to potentially execute arbitrary code inside the sandbox via a …
CVE-2026-1132158.82026-10-20Use after free in Extensions in Google Chrome prior to 156.0.8078.47 allowed a remote attacker to execute arbitrary code inside the sandbox via a crafted HTML page. (Chr…
CVE-2026-1132168.82026-10-20Use after free in Navigation in Google Chrome prior to 156.0.8078.47 allowed a remote attacker to execute arbitrary code inside the sandbox via a crafted HTML page. (Chr…
CVE-2026-1132178.82026-10-20Use after free in WebAppInstalls in Google Chrome on on Android prior to 156.0.8078.47 allowed a remote attacker to execute arbitrary code inside the sandbox via a craft…
CVE-2026-1132008.82026-10-20Use after free in ANGLE in Google Chrome prior to 156.0.8078.47 allowed a remote attacker to execute arbitrary code inside the sandbox via a crafted HTML page. (Chromium…
CVE-2026-1132028.82026-10-20Use after free in BrowserTag in Google Chrome prior to 156.0.8078.47 allowed a remote attacker to execute arbitrary code inside the sandbox via a crafted HTML page. (Chr…
CVE-2026-1132038.82026-10-20Use after free in CSS in Google Chrome prior to 156.0.8078.47 allowed a remote attacker to potentially execute arbitrary code inside the sandbox via a crafted HTML page.…
CVE-2026-1132048.82026-10-20Use after free in TrustedWebActivities in Google Chrome on on Android prior to 156.0.8078.47 allowed a remote attacker to potentially execute arbitrary code inside the s…
CVE-2026-1132058.82026-10-20Use after free in Variations in Google Chrome prior to 156.0.8078.47 allowed a remote attacker to execute arbitrary code inside the sandbox via a crafted HTML page. (Chr…
CVE-2026-1132068.82026-10-20Memory corruption in Omnibox in Google Chrome prior to 156.0.8078.47 allowed a remote attacker to execute arbitrary code inside the sandbox via a crafted HTML page. (Chr…
CVE-2026-1132078.82026-10-20Use after free in SiteIsolation in Google Chrome on on Android prior to 156.0.8078.47 allowed a remote attacker to execute arbitrary code inside the sandbox via a crafte…
CVE-2026-1132088.82026-10-20Use after free in ContextualSearch in Google Chrome prior to 156.0.8078.47 allowed a remote attacker to execute arbitrary code inside the sandbox via a crafted HTML page…
CVE-2026-1131928.82026-10-20Memory corruption in V8 in Google Chrome prior to 156.0.8078.47 allowed a remote attacker to execute arbitrary code inside the sandbox via a crafted HTML page. (Chromium…
CVE-2026-1131948.82026-10-20Memory corruption in Core in Google Chrome prior to 156.0.8078.47 allowed a remote attacker to execute arbitrary code inside the sandbox via a crafted HTML page. (Chromi…
CVE-2026-1131958.82026-10-20Improper input validation in Downloads in Google Chrome prior to 156.0.8078.47 allowed a remote attacker to potentially execute arbitrary code inside the sandbox via a c…
CVE-2026-1131978.82026-10-20Use after free in Forms in Google Chrome prior to 156.0.8078.47 allowed a remote attacker to execute arbitrary code inside the sandbox via a crafted HTML page. (Chromium…
CVE-2026-1131988.82026-10-20Use after free in Extensions in Google Chrome prior to 156.0.8078.47 allowed a remote attacker to execute arbitrary code inside the sandbox via a crafted HTML page. (Chr…
CVE-2026-1131838.82026-10-20Memory corruption in FedCM in Google Chrome prior to 156.0.8078.47 allowed a remote attacker to potentially execute arbitrary code inside the sandbox via a crafted HTML …
CVE-2026-1131848.82026-10-20Memory corruption in Scheduling in Google Chrome prior to 156.0.8078.47 allowed a remote attacker to potentially execute arbitrary code inside the sandbox via a crafted …
CVE-2026-1131858.82026-10-20Memory corruption in Extensions in Google Chrome prior to 156.0.8078.47 allowed a remote attacker to execute arbitrary code inside the sandbox via a crafted HTML page. (…
CVE-2026-1131878.82026-10-20Use after free in DOM in Google Chrome prior to 156.0.8078.47 allowed a remote attacker to execute arbitrary code inside the sandbox via a crafted HTML page. (Chromium s…
CVE-2026-1131888.82026-10-20Memory corruption in GPU in Google Chrome prior to 156.0.8078.47 allowed a remote attacker to potentially execute arbitrary code inside the sandbox via a crafted HTML pa…
CVE-2026-1131908.82026-10-20Use after free in ServiceWorker in Google Chrome prior to 156.0.8078.47 allowed a remote attacker to potentially execute arbitrary code inside the sandbox via a crafted …
CVE-2026-1131918.82026-10-20Use after free in Internals in Google Chrome on on Mac prior to 156.0.8078.47 allowed a remote attacker to execute arbitrary code inside the sandbox via a crafted HTML p…
CVE-2026-1131748.82026-10-20Use after free in Extensions in Google Chrome prior to 156.0.8078.47 allowed a remote attacker to execute arbitrary code inside the sandbox via a crafted HTML page. (Chr…
CVE-2026-1131758.82026-10-20Improper input validation in FileSystem in Google Chrome prior to 156.0.8078.47 allowed a remote attacker to execute arbitrary code inside the sandbox via a crafted HTML…
CVE-2026-1131768.82026-10-20Memory corruption in Omnibox in Google Chrome prior to 156.0.8078.47 allowed a remote attacker to potentially execute arbitrary code inside the sandbox via a crafted HTM…
CVE-2026-1131778.82026-10-20Use after free in FileSystem in Google Chrome prior to 156.0.8078.47 allowed a remote attacker to execute arbitrary code inside the sandbox via a crafted HTML page. (Chr…
CVE-2026-1131798.82026-10-20Use after free in Paint in Google Chrome prior to 156.0.8078.47 allowed a remote attacker to execute arbitrary code inside the sandbox via a crafted HTML page. (Chromium…
CVE-2026-1131818.82026-10-20Use after free in Navigation in Google Chrome prior to 156.0.8078.47 allowed a remote attacker to execute arbitrary code inside the sandbox via a crafted HTML page. (Chr…
CVE-2026-1131828.82026-10-20Memory corruption in Passwords in Google Chrome prior to 156.0.8078.47 allowed a remote attacker to execute arbitrary code inside the sandbox via a crafted HTML page. (C…
CVE-2026-1131648.82026-10-20Memory corruption in Voice in Google Chrome on on Android prior to 156.0.8078.47 allowed a remote attacker to execute arbitrary code inside the sandbox via a crafted HTM…
CVE-2026-1131658.82026-10-20Use after free in Core in Google Chrome on on Mac prior to 156.0.8078.47 allowed a remote attacker to execute arbitrary code inside the sandbox via a crafted HTML page. …
CVE-2026-1131668.82026-10-20Memory corruption in History in Google Chrome on on Android prior to 156.0.8078.47 allowed a remote attacker to execute arbitrary code inside the sandbox via a crafted H…
CVE-2026-1131678.82026-10-20Memory corruption in Network in Google Chrome prior to 156.0.8078.47 allowed a remote attacker to potentially execute arbitrary code inside the sandbox via a crafted HTM…
CVE-2026-1131688.82026-10-20Use after free in Permissions in Google Chrome prior to 156.0.8078.47 allowed a remote attacker to execute arbitrary code inside the sandbox via a crafted HTML page. (Ch…
CVE-2026-1131728.82026-10-20Memory corruption in ServiceWorker in Google Chrome prior to 156.0.8078.47 allowed a remote attacker to potentially execute arbitrary code inside the sandbox via a craft…
CVE-2026-1131738.82026-10-20Improper input validation in UI in Google Chrome on on Android prior to 156.0.8078.47 allowed a remote attacker to potentially execute arbitrary code inside the sandbox …
CVE-2026-1131558.82026-10-20Use after free in Glic in Google Chrome prior to 156.0.8078.47 allowed a remote attacker to execute arbitrary code inside the sandbox via a crafted HTML page. (Chromium …
CVE-2026-1131568.82026-10-20Use after free in Messages in Google Chrome on on Android prior to 156.0.8078.47 allowed a remote attacker to execute arbitrary code inside the sandbox via a crafted HTM…
CVE-2026-1131588.82026-10-20Use after free in Streaming in Google Chrome prior to 156.0.8078.47 allowed a remote attacker to execute arbitrary code inside the sandbox via a crafted HTML page. (Chro…
CVE-2026-1131608.82026-10-20Use after free in Turbolev in Google Chrome prior to 156.0.8078.47 allowed a remote attacker to execute arbitrary code inside the sandbox via a crafted HTML page. (Chrom…
CVE-2026-1131618.82026-10-20Use after free in WebRTC in Google Chrome prior to 156.0.8078.47 allowed a remote attacker to execute arbitrary code inside the sandbox via a crafted HTML page. (Chromiu…
CVE-2026-1131628.82026-10-20Improper input validation in Actor in Google Chrome prior to 156.0.8078.47 allowed a remote attacker to potentially execute arbitrary code inside the sandbox via a craft…
CVE-2026-1131638.82026-10-20Use after free in WebGL in Google Chrome on on Android prior to 156.0.8078.47 allowed a remote attacker to execute arbitrary code inside the sandbox via a crafted HTML p…
CVE-2026-1131478.82026-10-20Improper input validation in WebShare in Google Chrome prior to 156.0.8078.47 allowed a remote attacker to potentially execute arbitrary code inside the sandbox via a cr…
CVE-2026-1131488.82026-10-20Memory corruption in WebUI in Google Chrome prior to 156.0.8078.47 allowed a remote attacker to potentially execute arbitrary code inside the sandbox via a crafted HTML …
CVE-2026-1131498.82026-10-20Memory corruption in FullScreen in Google Chrome prior to 156.0.8078.47 allowed a remote attacker to execute arbitrary code inside the sandbox via a crafted HTML page. (…
CVE-2026-1131508.82026-10-20Memory corruption in Bindings in Google Chrome prior to 156.0.8078.47 allowed a remote attacker to potentially execute arbitrary code inside the sandbox via a crafted HT…
CVE-2026-1131528.82026-10-20Memory corruption in SignIn in Google Chrome prior to 156.0.8078.47 allowed a remote attacker to potentially execute arbitrary code inside the sandbox via a crafted HTML…
CVE-2026-1131538.82026-10-20Memory corruption in SiteIsolation in Google Chrome prior to 156.0.8078.47 allowed a remote attacker to potentially execute arbitrary code inside the sandbox via a craft…
CVE-2026-1131548.82026-10-20Memory corruption in Canvas in Google Chrome prior to 156.0.8078.47 allowed a remote attacker to potentially execute arbitrary code inside the sandbox via a crafted HTML…
CVE-2026-1131408.82026-10-20Use after free in ANGLE in Google Chrome prior to 156.0.8078.47 allowed a remote attacker to execute arbitrary code inside the sandbox via a crafted HTML page. (Chromium…
CVE-2026-1131418.82026-10-20Use after free in Transactions Platform in Google Chrome prior to 156.0.8078.47 allowed a remote attacker to execute arbitrary code inside the sandbox via a crafted HTML…
CVE-2026-1131438.82026-10-20Memory corruption in ANGLE in Google Chrome prior to 156.0.8078.47 allowed a remote attacker to read memory via a crafted HTML page. (Chromium security severity: Medium)
CVE-2026-1131458.82026-10-20Memory corruption in Messages in Google Chrome on on Android prior to 156.0.8078.47 allowed a remote attacker to potentially execute arbitrary code inside the sandbox vi…
CVE-2026-1131468.82026-10-20Memory corruption in PerformanceAPIs in Google Chrome prior to 156.0.8078.47 allowed a remote attacker to potentially execute arbitrary code inside the sandbox via a cra…
CVE-2026-1131308.82026-10-20Use after free in Actor in Google Chrome prior to 156.0.8078.47 allowed a remote attacker to execute arbitrary code inside the sandbox via a crafted HTML page. (Chromium…
CVE-2026-1131318.82026-10-20Memory corruption in Bluetooth in Google Chrome prior to 156.0.8078.47 allowed a remote attacker to execute arbitrary code inside the sandbox via a crafted HTML page. (C…
CVE-2026-1131328.82026-10-20Memory corruption in DevTools in Google Chrome prior to 156.0.8078.47 allowed a remote attacker to potentially execute arbitrary code inside the sandbox via a crafted HT…
CVE-2026-1131338.82026-10-20Memory corruption in PlatformIntegration in Google Chrome prior to 156.0.8078.47 allowed a remote attacker to execute arbitrary code inside the sandbox via a crafted HTM…
CVE-2026-1131348.82026-10-20Memory corruption in ANGLE in Google Chrome on on Windows prior to 156.0.8078.47 allowed a remote attacker to execute arbitrary code inside the sandbox via a crafted HTM…
CVE-2026-1131358.82026-10-20Memory corruption in PictureInPicture in Google Chrome prior to 156.0.8078.47 allowed a remote attacker to potentially execute arbitrary code inside the sandbox via a cr…
CVE-2026-1131368.82026-10-20Memory corruption in DevTools in Google Chrome prior to 156.0.8078.47 allowed a remote attacker to execute arbitrary code inside the sandbox via a crafted HTML page. (Ch…
CVE-2026-1131378.82026-10-20Memory corruption in Extensions in Google Chrome prior to 156.0.8078.47 allowed a remote attacker to potentially read memory inside the sandbox via a crafted HTML page. …
CVE-2026-1131198.82026-10-20Use after free in Network in Google Chrome on on Windows prior to 156.0.8078.47 allowed a remote attacker to execute arbitrary code inside the sandbox via a crafted HTML…
CVE-2026-1131208.82026-10-20Improper input validation in Media in Google Chrome prior to 156.0.8078.47 allowed a remote attacker to potentially execute arbitrary code inside the sandbox via a craft…
CVE-2026-1131218.82026-10-20Memory corruption in ContextMenu in Google Chrome on on Android prior to 156.0.8078.47 allowed a remote attacker to potentially execute arbitrary code inside the sandbox…
CVE-2026-1131238.82026-10-20Use after free in GPU in Google Chrome prior to 156.0.8078.47 allowed a remote attacker to execute arbitrary code inside the sandbox via a crafted HTML page. (Chromium s…
CVE-2026-1131248.82026-10-20Memory corruption in DataTransfer in Google Chrome prior to 156.0.8078.47 allowed a remote attacker to potentially execute arbitrary code inside the sandbox via a crafte…
CVE-2026-1131258.82026-10-20Memory corruption in DevTools in Google Chrome prior to 156.0.8078.47 allowed a remote attacker to execute arbitrary code inside the sandbox via a crafted HTML page. (Ch…
CVE-2026-1131278.82026-10-20Memory corruption in Browser in Google Chrome prior to 156.0.8078.47 allowed a remote attacker to potentially execute arbitrary code inside the sandbox via a crafted HTM…
CVE-2026-1131288.82026-10-20Missing authorization in Animation in Google Chrome prior to 156.0.8078.47 allowed a remote attacker to bypass web origin policy via a crafted HTML page. (Chromium secur…
CVE-2026-1131118.82026-10-20Use after free in Compositing in Google Chrome prior to 156.0.8078.47 allowed a remote attacker to execute arbitrary code inside the sandbox via a crafted HTML page. (Ch…
CVE-2026-1131128.82026-10-20Use after free in Extensions in Google Chrome prior to 156.0.8078.47 allowed a remote attacker to execute arbitrary code inside the sandbox via a crafted HTML page. (Chr…
CVE-2026-1131138.82026-10-20Use after free in Extensions in Google Chrome prior to 156.0.8078.47 allowed a remote attacker to execute arbitrary code inside the sandbox via a crafted HTML page. (Chr…
CVE-2026-1131148.82026-10-20Use after free in SignIn in Google Chrome prior to 156.0.8078.47 allowed a remote attacker to execute arbitrary code inside the sandbox via a crafted HTML page. (Chromiu…
CVE-2026-1131158.82026-10-20Use after free in Transactions Platform in Google Chrome prior to 156.0.8078.47 allowed a remote attacker to execute arbitrary code inside the sandbox via a crafted HTML…
CVE-2026-1131178.82026-10-20Improper input validation in ANGLE in Google Chrome on on Mac prior to 156.0.8078.47 allowed a remote attacker to potentially execute arbitrary code inside the sandbox v…
CVE-2026-1131188.82026-10-20Memory corruption in Extensions in Google Chrome prior to 156.0.8078.47 allowed a remote attacker to execute arbitrary code inside the sandbox via a crafted HTML page. (…
CVE-2026-1131038.82026-10-20Use after free in WebProtect in Google Chrome prior to 156.0.8078.47 allowed a remote attacker to execute arbitrary code inside the sandbox via a crafted HTML page. (Chr…
CVE-2026-1131048.82026-10-20Memory corruption in Frames in Google Chrome prior to 156.0.8078.47 allowed a remote attacker to potentially execute arbitrary code inside the sandbox via a crafted HTML…
CVE-2026-1131058.82026-10-20Use after free in Extensions in Google Chrome prior to 156.0.8078.47 allowed a remote attacker to execute arbitrary code inside the sandbox via a crafted HTML page. (Chr…
CVE-2026-1131068.82026-10-20Memory corruption in Skia in Google Chrome prior to 156.0.8078.47 allowed a remote attacker to execute arbitrary code inside the sandbox via a crafted HTML page. (Chromi…
CVE-2026-1131078.82026-10-20Use after free in Media in Google Chrome on on Android prior to 156.0.8078.47 allowed a remote attacker to execute arbitrary code inside the sandbox via a crafted HTML p…
CVE-2026-1131088.82026-10-20Use after free in Script in Google Chrome prior to 156.0.8078.47 allowed a remote attacker to execute arbitrary code inside the sandbox via a crafted HTML page. (Chromiu…
CVE-2026-1131098.82026-10-20Memory corruption in API in Google Chrome prior to 156.0.8078.47 allowed a remote attacker to potentially execute arbitrary code inside the sandbox via a crafted HTML pa…
CVE-2026-1131108.82026-10-20Memory corruption in ShadowDOM in Google Chrome prior to 156.0.8078.47 allowed a remote attacker to execute arbitrary code inside the sandbox via a crafted HTML page. (C…
CVE-2026-1130938.82026-10-20Memory corruption in DisplayLocking in Google Chrome prior to 156.0.8078.47 allowed a remote attacker to potentially execute arbitrary code inside the sandbox via a craf…
CVE-2026-1130948.82026-10-20Memory corruption in API in Google Chrome prior to 156.0.8078.47 allowed a remote attacker to execute arbitrary code inside the sandbox via a crafted HTML page. (Chromiu…
CVE-2026-1130958.82026-10-20Out of bounds read in Focus in Google Chrome prior to 156.0.8078.47 allowed a remote attacker to execute arbitrary code inside the sandbox via a crafted HTML page. (Chro…
CVE-2026-1130968.82026-10-20Memory corruption in Text in Google Chrome on on Android prior to 156.0.8078.47 allowed a remote attacker to execute arbitrary code inside the sandbox via a crafted HTML…
CVE-2026-1130978.82026-10-20Use after free in FileSystem in Google Chrome prior to 156.0.8078.47 allowed a remote attacker to potentially execute arbitrary code inside the sandbox via a crafted HTM…
CVE-2026-1130998.82026-10-20Improper input validation in Omnibox in Google Chrome on on Android prior to 156.0.8078.47 allowed a remote attacker to potentially execute arbitrary code inside the san…
CVE-2026-1131008.82026-10-20Memory corruption in Audio in Google Chrome prior to 156.0.8078.47 allowed a remote attacker to execute arbitrary code inside the sandbox via a crafted HTML page. (Chrom…
CVE-2026-1131018.82026-10-20Use after free in SiteIsolation in Google Chrome prior to 156.0.8078.47 allowed a remote attacker to execute arbitrary code inside the sandbox via a crafted HTML page. (…
CVE-2026-1130858.82026-10-20Use after free in Media in Google Chrome prior to 156.0.8078.47 allowed a remote attacker to execute arbitrary code inside the sandbox via a crafted HTML page. (Chromium…
CVE-2026-1130868.82026-10-20Improper input validation in Input in Google Chrome prior to 156.0.8078.47 allowed a remote attacker to potentially execute arbitrary code inside the sandbox via a craft…
CVE-2026-1130878.82026-10-20Use after free in Actor in Google Chrome prior to 156.0.8078.47 allowed a remote attacker to execute arbitrary code inside the sandbox via a crafted HTML page. (Chromium…
CVE-2026-1130888.82026-10-20Memory corruption in Mobile in Google Chrome on on Android prior to 156.0.8078.47 allowed a remote attacker to potentially execute arbitrary code inside the sandbox via …
CVE-2026-1130908.82026-10-20Memory corruption in Interstitials in Google Chrome prior to 156.0.8078.47 allowed a remote attacker to execute arbitrary code inside the sandbox via a crafted HTML page…
CVE-2026-1130918.82026-10-20Use after free in PerformanceAPIs in Google Chrome on on Android prior to 156.0.8078.47 allowed a remote attacker to execute arbitrary code inside the sandbox via a craf…
CVE-2026-1130928.82026-10-20Use after free in Passwords in Google Chrome on on Android prior to 156.0.8078.47 allowed a remote attacker to execute arbitrary code inside the sandbox via a crafted HT…
CVE-2026-1130758.82026-10-20Use after free in DevTools in Google Chrome prior to 156.0.8078.47 allowed a remote attacker to execute arbitrary code inside the sandbox via a crafted HTML page. (Chrom…
CVE-2026-1130818.82026-10-20Use after free in Compositing in Google Chrome prior to 156.0.8078.47 allowed a remote attacker to execute arbitrary code inside the sandbox via a crafted HTML page. (Ch…
CVE-2026-1130678.82026-10-20Use after free in Chromoting in Google Chrome prior to 156.0.8078.47 allowed a remote attacker to execute arbitrary code inside the sandbox via a crafted HTML page. (Chr…
CVE-2026-1130688.82026-10-20Use after free in Input in Google Chrome prior to 156.0.8078.47 allowed a remote attacker to execute arbitrary code inside the sandbox via a crafted HTML page. (Chromium…
CVE-2026-1130698.82026-10-20Memory corruption in Compositing in Google Chrome prior to 156.0.8078.47 allowed a remote attacker to execute arbitrary code inside the sandbox via a crafted HTML page. …
CVE-2026-1130718.82026-10-20Use after free in Notifications in Google Chrome on on Android prior to 156.0.8078.47 allowed a remote attacker to execute arbitrary code inside the sandbox via a crafte…
CVE-2026-1130738.82026-10-20Use after free in Browser in Google Chrome prior to 156.0.8078.47 allowed a remote attacker to execute arbitrary code inside the sandbox via a crafted HTML page. (Chromi…
CVE-2026-1130748.82026-10-20Use after free in Media in Google Chrome on on Windows prior to 156.0.8078.47 allowed a remote attacker to execute arbitrary code inside the sandbox via a crafted HTML p…
CVE-2026-1130578.82026-10-20Improper access control in ComputePressure in Google Chrome prior to 156.0.8078.47 allowed a remote attacker to bypass web origin policy via a crafted HTML page. (Chromi…
CVE-2026-1130588.82026-10-20Use after free in WebUI in Google Chrome prior to 156.0.8078.47 allowed a remote attacker to execute arbitrary code inside the sandbox via a crafted HTML page. (Chromium…
CVE-2026-1130598.82026-10-20Memory corruption in Sensor in Google Chrome prior to 156.0.8078.47 allowed a remote attacker to potentially execute arbitrary code inside the sandbox via a crafted HTML…
CVE-2026-1130608.82026-10-20Improper input validation in Bluetooth in Google Chrome prior to 156.0.8078.47 allowed a remote attacker to potentially execute arbitrary code inside the sandbox via a c…
CVE-2026-1130618.82026-10-20Memory corruption in Chromoting in Google Chrome prior to 156.0.8078.47 allowed a remote attacker to potentially execute arbitrary code inside the sandbox via a crafted …
CVE-2026-1130628.82026-10-20Improper input validation in API in Google Chrome prior to 156.0.8078.47 allowed a remote attacker to potentially execute arbitrary code inside the sandbox via a crafted…
CVE-2026-1130638.82026-10-20Improper input validation in Chromoting in Google Chrome prior to 156.0.8078.47 allowed a remote attacker to potentially execute arbitrary code inside the sandbox via a …
CVE-2026-1130648.82026-10-20Memory corruption in OptimizationGuide in Google Chrome prior to 156.0.8078.47 allowed a remote attacker to potentially execute arbitrary code inside the sandbox via a c…
CVE-2026-1130658.82026-10-20Use after free in Media in Google Chrome prior to 156.0.8078.47 allowed a remote attacker to execute arbitrary code inside the sandbox via a crafted HTML page. (Chromium…
CVE-2026-1130488.82026-10-20Memory corruption in DevTools in Google Chrome prior to 156.0.8078.47 allowed a remote attacker to potentially execute arbitrary code inside the sandbox via a crafted HT…
CVE-2026-1130498.82026-10-20Memory corruption in Core in Google Chrome prior to 156.0.8078.47 allowed a remote attacker to potentially execute arbitrary code inside the sandbox via a crafted HTML p…
CVE-2026-1130528.82026-10-20Memory corruption in V8 in Google Chrome prior to 156.0.8078.47 allowed a remote attacker to execute arbitrary code inside the sandbox via a crafted HTML page. (Chromium…
CVE-2026-1130538.82026-10-20Use after free in Cookies in Google Chrome on on Android prior to 156.0.8078.47 allowed a remote attacker to execute arbitrary code inside the sandbox via a crafted HTML…
CVE-2026-1130558.82026-10-20Type confusion in FullScreen in Google Chrome on on Android prior to 156.0.8078.47 allowed a remote attacker to execute arbitrary code inside the sandbox via a crafted H…
CVE-2026-1130408.82026-10-20Improper input validation in Proxy in Google Chrome prior to 156.0.8078.47 allowed a remote attacker to potentially execute arbitrary code inside the sandbox via a craft…
CVE-2026-1130418.82026-10-20Use after free in Actor in Google Chrome prior to 156.0.8078.47 allowed a remote attacker to execute arbitrary code inside the sandbox via a crafted HTML page. (Chromium…
CVE-2026-1130428.82026-10-20Use after free in Extensions in Google Chrome prior to 156.0.8078.47 allowed a remote attacker to execute arbitrary code inside the sandbox via a crafted HTML page. (Chr…
CVE-2026-1130438.82026-10-20Use after free in iOSWeb in Google Chrome on on iOS prior to 156.0.8078.47 allowed a remote attacker to execute arbitrary code inside the sandbox via a crafted HTML page…
CVE-2026-1130448.82026-10-20Use after free in V8 in Google Chrome prior to 156.0.8078.47 allowed a remote attacker to execute arbitrary code inside the sandbox via a crafted HTML page. (Chromium se…
CVE-2026-1130468.82026-10-20Improper input validation in Passwords in Google Chrome prior to 156.0.8078.47 allowed a remote attacker to potentially execute arbitrary code inside the sandbox via a c…
CVE-2026-1130318.82026-10-20Memory corruption in Media in Google Chrome on on Windows prior to 156.0.8078.47 allowed a remote attacker to execute arbitrary code inside the sandbox via a crafted HTM…
CVE-2026-1130328.82026-10-20Memory corruption in Omnibox in Google Chrome on on Android prior to 156.0.8078.47 allowed a remote attacker to execute arbitrary code inside the sandbox via a crafted H…
CVE-2026-1130338.82026-10-20Use after free in Streaming in Google Chrome prior to 156.0.8078.47 allowed a remote attacker to execute arbitrary code inside the sandbox via a crafted HTML page. (Chro…
CVE-2026-1130348.82026-10-20Memory corruption in FileSystem in Google Chrome prior to 156.0.8078.47 allowed a remote attacker to execute arbitrary code inside the sandbox via a crafted HTML page. (…
CVE-2026-1130368.82026-10-20Memory corruption in HTML in Google Chrome prior to 156.0.8078.47 allowed a remote attacker to potentially execute arbitrary code inside the sandbox via a crafted HTML p…
CVE-2026-1130378.82026-10-20Use after free in WebSockets in Google Chrome prior to 156.0.8078.47 allowed a remote attacker to execute arbitrary code inside the sandbox via a crafted HTML page. (Chr…
CVE-2026-1130398.82026-10-20Use after free in Bookmarks in Google Chrome prior to 156.0.8078.47 allowed a remote attacker to execute arbitrary code inside the sandbox via a crafted HTML page. (Chro…
CVE-2026-1130228.82026-10-20Memory corruption in PDFium in Google Chrome prior to 156.0.8078.47 allowed a remote attacker to potentially execute arbitrary code inside the sandbox via a crafted HTML…
CVE-2026-1130248.82026-10-20Use after free in WebAppInstalls in Google Chrome prior to 156.0.8078.47 allowed a remote attacker to execute arbitrary code inside the sandbox via a crafted HTML page. …
CVE-2026-1130258.82026-10-20Use after free in Input in Google Chrome prior to 156.0.8078.47 allowed a remote attacker to execute arbitrary code inside the sandbox via a crafted HTML page. (Chromium…
CVE-2026-1130278.82026-10-20Memory corruption in WebFonts in Google Chrome prior to 156.0.8078.47 allowed a remote attacker to potentially execute arbitrary code inside the sandbox via a crafted HT…
CVE-2026-1130288.82026-10-20Use after free in Media in Google Chrome prior to 156.0.8078.47 allowed a remote attacker to execute arbitrary code inside the sandbox via a crafted HTML page. (Chromium…
CVE-2026-1130298.82026-10-20Improper access control in ANGLE in Google Chrome prior to 156.0.8078.47 allowed a remote attacker to potentially execute arbitrary code inside the sandbox via a crafted…
CVE-2026-1130308.82026-10-20Improper access control in V8 in Google Chrome prior to 156.0.8078.47 allowed a remote attacker to potentially bypass web origin policy via a crafted HTML page. (Chromiu…
CVE-2026-1130158.82026-10-20Use after free in Workers in Google Chrome prior to 156.0.8078.47 allowed a remote attacker to execute arbitrary code inside the sandbox via a crafted HTML page. (Chromi…
CVE-2026-1130168.82026-10-20Improper input validation in Extensions in Google Chrome prior to 156.0.8078.47 allowed a remote attacker to potentially execute arbitrary code inside the sandbox via a …
CVE-2026-1130178.82026-10-20Use after free in Views in Google Chrome prior to 156.0.8078.47 allowed a remote attacker to execute arbitrary code inside the sandbox via a crafted HTML page. (Chromium…
CVE-2026-1130188.82026-10-20Memory corruption in IME in Google Chrome prior to 156.0.8078.47 allowed a remote attacker to potentially execute arbitrary code inside the sandbox via a crafted HTML pa…
CVE-2026-1130198.82026-10-20Use after free in Turbolev in Google Chrome prior to 156.0.8078.47 allowed a remote attacker to execute arbitrary code inside the sandbox via a crafted HTML page. (Chrom…
CVE-2026-1130218.82026-10-20Use after free in WebAppInstalls in Google Chrome prior to 156.0.8078.47 allowed a remote attacker to execute arbitrary code inside the sandbox via a crafted HTML page. …
CVE-2026-1130068.82026-10-20Out of bounds read in Navigation in Google Chrome prior to 156.0.8078.47 allowed a remote attacker to potentially execute arbitrary code inside the sandbox via a crafted…
CVE-2026-1130088.82026-10-20Memory corruption in Transactions Platform in Google Chrome prior to 156.0.8078.47 allowed a remote attacker to potentially execute arbitrary code inside the sandbox via…
CVE-2026-1130098.82026-10-20Use after free in WindowControlsOverlay in Google Chrome prior to 156.0.8078.47 allowed a remote attacker to execute arbitrary code inside the sandbox via a crafted HTML…
CVE-2026-1130118.82026-10-20Use after free in CredentialProvider in Google Chrome on on Windows prior to 156.0.8078.47 allowed a remote attacker to execute arbitrary code inside the sandbox via a c…
CVE-2026-1130128.82026-10-20Improper input validation in GPU in Google Chrome prior to 156.0.8078.47 allowed a remote attacker to potentially execute arbitrary code inside the sandbox via a crafted…
CVE-2026-1130138.82026-10-20Memory corruption in DevTools in Google Chrome prior to 156.0.8078.47 allowed a remote attacker to execute arbitrary code inside the sandbox via a crafted HTML page. (Ch…
CVE-2026-1129968.82026-10-20Memory corruption in Loader in Google Chrome prior to 156.0.8078.47 allowed a remote attacker to execute arbitrary code inside the sandbox via a crafted HTML page. (Chro…
CVE-2026-1129978.82026-10-20Memory corruption in CSS in Google Chrome prior to 156.0.8078.47 allowed a remote attacker to potentially execute arbitrary code inside the sandbox via a crafted HTML pa…
CVE-2026-1129988.82026-10-20Memory corruption in Views in Google Chrome prior to 156.0.8078.47 allowed a remote attacker to execute arbitrary code inside the sandbox via a crafted HTML page. (Chrom…
CVE-2026-1129998.82026-10-20Use after free in API in Google Chrome prior to 156.0.8078.47 allowed a remote attacker to execute arbitrary code inside the sandbox via a crafted HTML page. (Chromium s…
CVE-2026-1130008.82026-10-20Memory corruption in Paint in Google Chrome prior to 156.0.8078.47 allowed a remote attacker to execute arbitrary code inside the sandbox via a crafted HTML page. (Chrom…
CVE-2026-1130018.82026-10-20Use after free in Workers in Google Chrome prior to 156.0.8078.47 allowed a remote attacker to execute arbitrary code inside the sandbox via a crafted HTML page. (Chromi…
CVE-2026-1130038.82026-10-20Memory corruption in HID in Google Chrome prior to 156.0.8078.47 allowed a remote attacker to execute arbitrary code inside the sandbox via a crafted HTML page. (Chromiu…
CVE-2026-1130048.82026-10-20Memory corruption in Sync in Google Chrome prior to 156.0.8078.47 allowed a remote attacker to execute arbitrary code inside the sandbox via a crafted HTML page. (Chromi…
CVE-2026-1130058.82026-10-20Memory corruption in Bluetooth in Google Chrome prior to 156.0.8078.47 allowed a remote attacker to potentially execute arbitrary code inside the sandbox via a crafted H…
CVE-2026-1129958.82026-10-20Use after free in Animation in Google Chrome prior to 156.0.8078.47 allowed a remote attacker to execute arbitrary code inside the sandbox via a crafted HTML page. (Chro…
CVE-2026-1129938.82026-10-20Use after free in Input in Google Chrome prior to 156.0.8078.47 allowed a remote attacker to execute arbitrary code inside the sandbox via a crafted HTML page. (Chromium…
CVE-2026-1129948.82026-10-20Memory corruption in Browser in Google Chrome prior to 156.0.8078.47 allowed a remote attacker to execute arbitrary code inside the sandbox via a crafted HTML page. (Chr…
CVE-2026-1130838.82026-10-20Memory corruption in Actor in Google Chrome on on Android prior to 156.0.8078.47 allowed a remote attacker to execute arbitrary code inside the sandbox via a crafted HTM…
CVE-2026-1131808.82026-10-20Memory corruption in ContentCapture in Google Chrome on on Android prior to 156.0.8078.47 allowed a remote attacker to execute arbitrary code inside the sandbox via a cr…
CVE-2026-1130808.82026-10-20Use after free in WebAppInstalls in Google Chrome prior to 156.0.8078.47 allowed a remote attacker to execute arbitrary code inside the sandbox via a crafted HTML page. …
CVE-2026-1131708.82026-10-20Use after free in Autofill in Google Chrome on on Android prior to 156.0.8078.47 allowed a remote attacker to execute arbitrary code inside the sandbox via a crafted HTM…
CVE-2026-1130768.82026-10-20Use after free in Toolbar in Google Chrome on on Android prior to 156.0.8078.47 allowed a remote attacker to execute arbitrary code inside the sandbox via a crafted HTML…
CVE-2026-1132208.82026-10-20Memory corruption in Extensions in Google Chrome on on Android prior to 156.0.8078.47 allowed a remote attacker to potentially execute arbitrary code inside the sandbox …
CVE-2026-1130798.82026-10-20Use after free in SiteIsolation in Google Chrome prior to 156.0.8078.47 allowed a remote attacker to potentially execute arbitrary code inside the sandbox via a crafted …
CVE-2026-1133406.52026-10-20Memory corruption in ANGLE in Google Chrome on on Windows prior to 156.0.8078.47 allowed a remote attacker to potentially read memory inside the sandbox via a crafted HT…
CVE-2026-1133416.52026-10-20Memory corruption in Skia in Google Chrome on on Android prior to 156.0.8078.47 allowed a remote attacker to potentially read memory inside the sandbox via a crafted HTM…
CVE-2026-1133266.52026-10-20Memory corruption in Core in Google Chrome on on Windows prior to 156.0.8078.47 allowed a remote attacker to potentially read memory inside the sandbox via a crafted HTM…
CVE-2026-1133296.52026-10-20Out of bounds read in Installer in Google Chrome on on Mac prior to 156.0.8078.47 allowed a remote attacker to potentially read memory inside the sandbox via a crafted H…
CVE-2026-1133336.52026-10-20Memory corruption in Extensions in Google Chrome prior to 156.0.8078.47 allowed a remote attacker to potentially read memory inside the sandbox via a crafted HTML page. …
CVE-2026-1133226.52026-10-20Memory corruption in Dawn in Google Chrome prior to 156.0.8078.47 allowed a remote attacker to potentially read memory inside the sandbox via a crafted HTML page. (Chrom…
CVE-2026-1133256.52026-10-20Memory corruption in SignIn in Google Chrome on on iOS prior to 156.0.8078.47 allowed a remote attacker to potentially read memory inside the sandbox via a crafted HTML …
CVE-2026-1133096.52026-10-20Out of bounds read in Media in Google Chrome prior to 156.0.8078.47 allowed a remote attacker to read memory inside the sandbox via a crafted HTML page. (Chromium securi…
CVE-2026-1133106.52026-10-20Out of bounds read in Bluetooth in Google Chrome prior to 156.0.8078.47 allowed a remote attacker to read memory inside the sandbox via a crafted HTML page. (Chromium se…
CVE-2026-1133046.52026-10-20Memory corruption in GPU in Google Chrome on on Android prior to 156.0.8078.47 allowed a remote attacker to potentially read memory inside the sandbox via a crafted HTML…
CVE-2026-1132956.52026-10-20Out of bounds read in ANGLE in Google Chrome on on Windows prior to 156.0.8078.47 allowed a remote attacker to read memory inside the sandbox via a crafted HTML page. (C…
CVE-2026-1132966.52026-10-20Memory corruption in Actor in Google Chrome prior to 156.0.8078.47 allowed a remote attacker to potentially read memory inside the sandbox via a crafted HTML page. (Chro…
CVE-2026-1132976.52026-10-20Improper access control in Ozone in Google Chrome prior to 156.0.8078.47 allowed a remote attacker to leak sensitive information via a crafted HTML page. (Chromium secur…
CVE-2026-1132776.52026-10-20Out of bounds read in CustomTabs in Google Chrome on on Android prior to 156.0.8078.47 allowed a remote attacker to read memory inside the sandbox via a crafted HTML pag…
CVE-2026-1132466.52026-10-20Memory corruption in iOSWebView in Google Chrome on on iOS prior to 156.0.8078.47 allowed a remote attacker to potentially read memory inside the sandbox via a crafted H…
CVE-2026-1132376.52026-10-20Memory corruption in Chromoting in Google Chrome prior to 156.0.8078.47 allowed a remote attacker to read memory inside the sandbox via a crafted HTML page. (Chromium se…
CVE-2026-1132236.52026-10-20Memory corruption in DevTools in Google Chrome prior to 156.0.8078.47 allowed a remote attacker to potentially read memory inside the sandbox via a crafted HTML page. (C…
CVE-2026-1132256.52026-10-20Memory corruption in Browser in Google Chrome on on Android prior to 156.0.8078.47 allowed a remote attacker to potentially read memory inside the sandbox via a crafted …
CVE-2026-1132016.52026-10-20Memory corruption in Google Lens in Google Chrome prior to 156.0.8078.47 allowed a remote attacker to potentially read memory inside the sandbox via a crafted HTML page.…
CVE-2026-1131936.52026-10-20Memory corruption in V8 in Google Chrome prior to 156.0.8078.47 allowed a remote attacker to potentially read memory inside the sandbox via a crafted HTML page. (Chromiu…
CVE-2026-1131996.52026-10-20Out of bounds read in Payments in Google Chrome prior to 156.0.8078.47 allowed a remote attacker to read memory inside the sandbox via a crafted HTML page. (Chromium sec…
CVE-2026-1131786.52026-10-20Memory corruption in Views in Google Chrome on on Mac prior to 156.0.8078.47 allowed a remote attacker to potentially read memory inside the sandbox via a crafted HTML p…
CVE-2026-1131576.52026-10-20Information leak in ANGLE in Google Chrome on on Windows prior to 156.0.8078.47 allowed a remote attacker to leak sensitive information via a crafted HTML page. (Chromiu…
CVE-2026-1131596.52026-10-20Improper access control in DevTools in Google Chrome prior to 156.0.8078.47 allowed a remote attacker to potentially leak sensitive information via a crafted HTML page. …
CVE-2026-1131516.52026-10-20Out of bounds read in Actor in Google Chrome prior to 156.0.8078.47 allowed a remote attacker to read memory inside the sandbox via a crafted HTML page. (Chromium securi…
CVE-2026-1131396.52026-10-20Memory corruption in Autofill in Google Chrome prior to 156.0.8078.47 allowed a remote attacker to potentially read memory inside the sandbox via a crafted HTML page. (C…
CVE-2026-1131426.52026-10-20Memory corruption in Extensions in Google Chrome prior to 156.0.8078.47 allowed a remote attacker to potentially read memory inside the sandbox via a crafted HTML page. …
CVE-2026-1131446.52026-10-20Memory corruption in Speech in Google Chrome prior to 156.0.8078.47 allowed a remote attacker to read memory inside the sandbox via a crafted HTML page. (Chromium securi…
CVE-2026-1131296.52026-10-20Improper access control in Extensions in Google Chrome prior to 156.0.8078.47 allowed a remote attacker to potentially leak sensitive information via a crafted HTML page…
CVE-2026-1131226.52026-10-20Memory corruption in Loader in Google Chrome prior to 156.0.8078.47 allowed a remote attacker to potentially read memory inside the sandbox via a crafted HTML page. (Chr…
CVE-2026-1131026.52026-10-20Out of bounds read in FileSystem in Google Chrome prior to 156.0.8078.47 allowed a remote attacker to read memory inside the sandbox via a crafted HTML page. (Chromium s…
CVE-2026-1130986.52026-10-20Memory corruption in CacheStorage in Google Chrome prior to 156.0.8078.47 allowed a remote attacker to potentially read memory inside the sandbox via a crafted HTML page…
CVE-2026-1130666.52026-10-20Memory corruption in Fonts in Google Chrome prior to 156.0.8078.47 allowed a remote attacker to read memory inside the sandbox via a crafted HTML page. (Chromium securit…
CVE-2026-1130706.52026-10-20Out of bounds read in GetUserMedia in Google Chrome prior to 156.0.8078.47 allowed a remote attacker to read memory inside the sandbox via a crafted HTML page. (Chromium…
CVE-2026-1130506.52026-10-20Out of bounds read in HID in Google Chrome prior to 156.0.8078.47 allowed a remote attacker to read memory inside the sandbox via a crafted HTML page. (Chromium security…
CVE-2026-1130516.52026-10-20Memory corruption in CSS in Google Chrome prior to 156.0.8078.47 allowed a remote attacker to potentially read memory inside the sandbox via a crafted HTML page. (Chromi…
CVE-2026-1130546.52026-10-20Out of bounds read in SiteIsolation in Google Chrome prior to 156.0.8078.47 allowed a remote attacker to read memory inside the sandbox via a crafted HTML page. (Chromiu…
CVE-2026-1130456.52026-10-20Out of bounds read in Offline in Google Chrome on on Android prior to 156.0.8078.47 allowed a remote attacker to potentially read memory inside the sandbox via a crafted…
CVE-2026-1130476.52026-10-20Memory corruption in BrowserTag in Google Chrome prior to 156.0.8078.47 allowed a remote attacker to potentially read memory inside the sandbox via a crafted HTML page. …
CVE-2026-1130356.52026-10-20Out of bounds read in API in Google Chrome prior to 156.0.8078.47 allowed a remote attacker to potentially read memory inside the sandbox via a crafted HTML page. (Chrom…
CVE-2026-1130386.52026-10-20Memory corruption in DevTools in Google Chrome prior to 156.0.8078.47 allowed a remote attacker to potentially read memory inside the sandbox via a crafted HTML page. (C…
CVE-2026-1130266.52026-10-20Memory corruption in PDF in Google Chrome on on Android prior to 156.0.8078.47 allowed a remote attacker to potentially read memory inside the sandbox via a crafted HTML…
CVE-2026-1130106.52026-10-20Out of bounds read in Extensions in Google Chrome prior to 156.0.8078.47 allowed a remote attacker to read memory inside the sandbox via a crafted HTML page. (Chromium s…
CVE-2026-1130026.52026-10-20Memory corruption in Transactions Platform in Google Chrome prior to 156.0.8078.47 allowed a remote attacker to potentially read memory inside the sandbox via a crafted …
CVE-2026-1130776.52026-10-20Memory corruption in Core in Google Chrome on on Mac prior to 156.0.8078.47 allowed a remote attacker to potentially read memory inside the sandbox via a crafted HTML pa…
CVE-2026-1132246.52026-10-20Memory corruption in WebAppInstalls in Google Chrome on on Android prior to 156.0.8078.47 allowed a remote attacker to potentially read memory inside the sandbox via a c…
CVE-2026-1132096.52026-10-20Memory corruption in Navigation in Google Chrome on on iOS prior to 156.0.8078.47 allowed a remote attacker to potentially read memory inside the sandbox via a crafted H…
CVE-2026-1130826.52026-10-20Memory corruption in ANGLE in Google Chrome on on Windows prior to 156.0.8078.47 allowed a remote attacker to potentially read memory inside the sandbox via a crafted HT…
CVE-2026-113196–2026-10-20Improper access control in Mobile in Google Chrome on on iOS prior to 156.0.8078.47 allowed a remote attacker to bypass web origin policy via a crafted HTML page. (Chrom…
CVE-2026-113212–2026-10-20Memory corruption in PDF in Google Chrome prior to 156.0.8078.47 allowed a remote attacker to potentially via a crafted HTML page. (Chromium security severity: High)
chromium -- security fixesentered 2026-10-22

CVE-2026-112992, CVE-2026-112993, CVE-2026-112994, CVE-2026-112995, CVE-2026-112996, CVE-2026-112997, CVE-2026-112998, CVE-2026-112999, CVE-2026-113000, CVE-2026-113001, CVE-2026-113002, CVE-2026-113003, CVE-2026-113004, CVE-2026-113005, CVE-2026-113006, CVE-2026-113007, CVE-2026-113008, CVE-2026-113009, CVE-2026-113010, CVE-2026-113011, CVE-2026-113012, CVE-2026-113013, CVE-2026-113014, CVE-2026-113015, CVE-2026-113016, CVE-2026-113017, CVE-2026-113018, CVE-2026-113019, CVE-2026-113020, CVE-2026-113021, CVE-2026-113022, CVE-2026-113023, CVE-2026-113024, CVE-2026-113025, CVE-2026-113026, CVE-2026-113027, CVE-2026-113028, CVE-2026-113029, CVE-2026-113030, CVE-2026-113031, CVE-2026-113032, CVE-2026-113033, CVE-2026-113034, CVE-2026-113035, CVE-2026-113036, CVE-2026-113037, CVE-2026-113038, CVE-2026-113039, CVE-2026-113040, CVE-2026-113041, CVE-2026-113042, CVE-2026-113043, CVE-2026-113044, CVE-2026-113045, CVE-2026-113046, CVE-2026-113047, CVE-2026-113048, CVE-2026-113049, CVE-2026-113050, CVE-2026-113051, CVE-2026-113052, CVE-2026-113053, CVE-2026-113054, CVE-2026-113055,

chromium -- security fixesentered 2026-09-26

CVE-2026-95274, CVE-2026-95275, CVE-2026-95276, CVE-2026-95277, CVE-2026-95278, CVE-2026-95279, CVE-2026-95280, CVE-2026-95281, CVE-2026-95282, CVE-2026-95283, CVE-2026-95284, CVE-2026-95285, CVE-2026-95286, CVE-2026-95287, CVE-2026-95288, CVE-2026-95289, CVE-2026-95290, CVE-2026-95291, CVE-2026-95292, CVE-2026-95293, CVE-2026-95294, CVE-2026-95295, CVE-2026-95296, CVE-2026-95297, CVE-2026-95298, CVE-2026-95299, CVE-2026-95300, CVE-2026-95301, CVE-2026-95302, CVE-2026-95303, CVE-2026-95304, CVE-2026-95305, CVE-2026-95306, CVE-2026-95307, CVE-2026-95308, CVE-2026-95309, CVE-2026-95310, CVE-2026-95311, CVE-2026-95312, CVE-2026-95313, CVE-2026-95314, CVE-2026-95315, CVE-2026-95316, CVE-2026-95317, CVE-2026-95318, CVE-2026-95319, CVE-2026-95320, CVE-2026-95321, CVE-2026-95322, CVE-2026-95323, CVE-2026-95324, CVE-2026-95325, CVE-2026-95326, CVE-2026-95327, CVE-2026-95328, CVE-2026-95329, CVE-2026-95330, CVE-2026-95331, CVE-2026-95332, CVE-2026-95333, CVE-2026-95334, CVE-2026-95335, CVE-2026-95336, CVE-2026-95337, CVE-2026-95338, CVE-2026-95339, CVE-2026-95340, CVE-2026-95341, CVE-

chromium -- security fixesentered 2026-08-31

CVE-2026-78891, CVE-2026-78892, CVE-2026-78893, CVE-2026-78894, CVE-2026-78895, CVE-2026-78896, CVE-2026-78897, CVE-2026-78898, CVE-2026-78899, CVE-2026-78900, CVE-2026-78901, CVE-2026-78903, CVE-2026-78904, CVE-2026-78905, CVE-2026-78906, CVE-2026-78907, CVE-2026-78908, CVE-2026-78909, CVE-2026-78910, CVE-2026-78911, CVE-2026-78912, CVE-2026-78913, CVE-2026-78914, CVE-2026-78915, CVE-2026-78934, CVE-2026-78935, CVE-2026-78936, CVE-2026-78937, CVE-2026-78938, CVE-2026-78939, CVE-2026-78940, CVE-2026-78941, CVE-2026-78942, CVE-2026-78943, CVE-2026-78944, CVE-2026-78945, CVE-2026-78946, CVE-2026-78947, CVE-2026-78948, CVE-2026-78949, CVE-2026-78950, CVE-2026-78951, CVE-2026-78952, CVE-2026-78953, CVE-2026-78954, CVE-2026-78955, CVE-2026-78956, CVE-2026-78957, CVE-2026-78958, CVE-2026-78959, CVE-2026-78960, CVE-2026-78961, CVE-2026-78962, CVE-2026-78963, CVE-2026-78964, CVE-2026-78965, CVE-2026-78966, CVE-2026-78967, CVE-2026-78968, CVE-2026-78969, CVE-2026-78974, CVE-2026-78975, CVE-2026-78976, CVE-2026-78977, CVE-2026-78978, CVE-2026-78979, CVE-2026-78980, CVE-2026-78981, CVE-

chromium -- security fixesentered 2026-08-13

CVE-2026-19137, CVE-2026-19138, CVE-2026-19139, CVE-2026-19140, CVE-2026-19141, CVE-2026-19142, CVE-2026-19143, CVE-2026-19144, CVE-2026-19145, CVE-2026-19146, CVE-2026-19147, CVE-2026-19148, CVE-2026-19149, CVE-2026-19150, CVE-2026-19151, CVE-2026-19152, CVE-2026-19153, CVE-2026-19154, CVE-2026-19155, CVE-2026-19156, CVE-2026-19157, CVE-2026-19158, CVE-2026-19159, CVE-2026-19160, CVE-2026-19161, CVE-2026-19162, CVE-2026-19163, CVE-2026-19164, CVE-2026-19165, CVE-2026-19166, CVE-2026-19167, CVE-2026-19168, CVE-2026-19169, CVE-2026-19170, CVE-2026-19171, CVE-2026-19172, CVE-2026-19173, CVE-2026-19174, CVE-2026-19175, CVE-2026-19176, CVE-2026-19177

chromium -- security fixesentered 2026-07-30

CVE-2026-17650, CVE-2026-17651, CVE-2026-17652, CVE-2026-17653, CVE-2026-17654, CVE-2026-17655, CVE-2026-17656, CVE-2026-17657, CVE-2026-17658, CVE-2026-17659, CVE-2026-17660, CVE-2026-17661, CVE-2026-17662, CVE-2026-17663, CVE-2026-17664, CVE-2026-17665, CVE-2026-17666, CVE-2026-17667, CVE-2026-17668, CVE-2026-17669, CVE-2026-17670, CVE-2026-17671, CVE-2026-17672, CVE-2026-17673, CVE-2026-17674, CVE-2026-17675, CVE-2026-17676, CVE-2026-17677, CVE-2026-17678, CVE-2026-17679, CVE-2026-17680, CVE-2026-17681, CVE-2026-17682, CVE-2026-17683, CVE-2026-17684, CVE-2026-17685, CVE-2026-17686, CVE-2026-17687, CVE-2026-17688, CVE-2026-17689, CVE-2026-17690, CVE-2026-17691, CVE-2026-17692, CVE-2026-17693, CVE-2026-17694, CVE-2026-17695, CVE-2026-17696, CVE-2026-17697, CVE-2026-17698, CVE-2026-17699, CVE-2026-17700, CVE-2026-17701, CVE-2026-17702, CVE-2026-17703, CVE-2026-17704, CVE-2026-17705, CVE-2026-17706, CVE-2026-17707, CVE-2026-17708, CVE-2026-17709, CVE-2026-17710, CVE-2026-17711, CVE-2026-17712, CVE-2026-17713, CVE-2026-17714, CVE-2026-17715, CVE-2026-17716, CVE-2026-17717, CVE-

chromium -- security fixesentered 2026-07-02

CVE-2026-13774, CVE-2026-13775, CVE-2026-13776, CVE-2026-13777, CVE-2026-13778, CVE-2026-13779, CVE-2026-13780, CVE-2026-13781, CVE-2026-13782, CVE-2026-13783, CVE-2026-13784, CVE-2026-13785, CVE-2026-13786, CVE-2026-13787, CVE-2026-13788, CVE-2026-13789, CVE-2026-13790, CVE-2026-13791, CVE-2026-13792, CVE-2026-13793, CVE-2026-13794, CVE-2026-13795, CVE-2026-13796, CVE-2026-13797, CVE-2026-13798, CVE-2026-13799, CVE-2026-13800, CVE-2026-13801, CVE-2026-13802, CVE-2026-13803, CVE-2026-13804, CVE-2026-13805, CVE-2026-13806, CVE-2026-13807, CVE-2026-13808, CVE-2026-13809, CVE-2026-13810, CVE-2026-13811, CVE-2026-13812, CVE-2026-13813, CVE-2026-13814, CVE-2026-13815, CVE-2026-13816, CVE-2026-13817, CVE-2026-13818, CVE-2026-13819, CVE-2026-13820, CVE-2026-13821, CVE-2026-13822, CVE-2026-13823, CVE-2026-13824, CVE-2026-13825, CVE-2026-13826, CVE-2026-13827, CVE-2026-13828, CVE-2026-13829, CVE-2026-13830, CVE-2026-13831, CVE-2026-13832, CVE-2026-13833, CVE-2026-13834, CVE-2026-13835, CVE-2026-13836, CVE-2026-13837, CVE-2026-13838, CVE-2026-13839, CVE-2026-13840, CVE-2026-13841, CVE-

chromium -- security fixesentered 2026-06-15

CVE-2026-12437, CVE-2026-12438, CVE-2026-12439, CVE-2026-12440, CVE-2026-12441, CVE-2026-12442, CVE-2026-12443, CVE-2026-12444, CVE-2026-12445, CVE-2026-12446, CVE-2026-12447, CVE-2026-12448, CVE-2026-12449, CVE-2026-12450, CVE-2026-12451, CVE-2026-12452, CVE-2026-12453, CVE-2026-12454, CVE-2026-12455, CVE-2026-12456, CVE-2026-12457, CVE-2026-12458, CVE-2026-12459, CVE-2026-12460, CVE-2026-12461, CVE-2026-12462, CVE-2026-12463, CVE-2026-12464, CVE-2026-12465, CVE-2026-12466, CVE-2026-12467, CVE-2026-12468, CVE-2026-12469

chromium -- security fixesentered 2026-06-10

CVE-2026-11628, CVE-2026-11629, CVE-2026-11630, CVE-2026-11631, CVE-2026-11632, CVE-2026-11633, CVE-2026-11634, CVE-2026-11635, CVE-2026-11636, CVE-2026-11637, CVE-2026-11638, CVE-2026-11639, CVE-2026-11640, CVE-2026-11641, CVE-2026-11642, CVE-2026-11643, CVE-2026-11644, CVE-2026-11645, CVE-2026-11646, CVE-2026-11647, CVE-2026-11648, CVE-2026-11649, CVE-2026-11650, CVE-2026-11651, CVE-2026-11652, CVE-2026-11653, CVE-2026-11654, CVE-2026-11655, CVE-2026-11656, CVE-2026-11657, CVE-2026-11658, CVE-2026-11659, CVE-2026-11660, CVE-2026-11661, CVE-2026-11662, CVE-2026-11663, CVE-2026-11664, CVE-2026-11665, CVE-2026-11666, CVE-2026-11667, CVE-2026-11668, CVE-2026-11669, CVE-2026-11670, CVE-2026-11671, CVE-2026-11672, CVE-2026-11673, CVE-2026-11674, CVE-2026-11675, CVE-2026-11676, CVE-2026-11677, CVE-2026-11678, CVE-2026-11679, CVE-2026-11680, CVE-2026-11681, CVE-2026-11682, CVE-2026-11683, CVE-2026-11684, CVE-2026-11685, CVE-2026-11686, CVE-2026-11687, CVE-2026-11688, CVE-2026-11689, CVE-2026-11690, CVE-2026-11691, CVE-2026-11692, CVE-2026-11693, CVE-2026-11694, CVE-2026-11695, CVE-

chromium -- security fixesentered 2026-05-30

CVE-2026-10000, CVE-2026-10001, CVE-2026-10002, CVE-2026-10003, CVE-2026-10004, CVE-2026-10005, CVE-2026-10006, CVE-2026-10007, CVE-2026-10008, CVE-2026-10009, CVE-2026-10010, CVE-2026-10011, CVE-2026-10012, CVE-2026-10013, CVE-2026-10014, CVE-2026-10015, CVE-2026-10016, CVE-2026-10017, CVE-2026-10018, CVE-2026-10019, CVE-2026-10020, CVE-2026-10021, CVE-2026-10022, CVE-2026-9872, CVE-2026-9873, CVE-2026-9874, CVE-2026-9875, CVE-2026-9876, CVE-2026-9877, CVE-2026-9878, CVE-2026-9879, CVE-2026-9880, CVE-2026-9881, CVE-2026-9882, CVE-2026-9883, CVE-2026-9884, CVE-2026-9885, CVE-2026-9886, CVE-2026-9887, CVE-2026-9888, CVE-2026-9889, CVE-2026-9890, CVE-2026-9891, CVE-2026-9892, CVE-2026-9893, CVE-2026-9894, CVE-2026-9895, CVE-2026-9896, CVE-2026-9897, CVE-2026-9898, CVE-2026-9899, CVE-2026-9900, CVE-2026-9901, CVE-2026-9902, CVE-2026-9903, CVE-2026-9904, CVE-2026-9905, CVE-2026-9906, CVE-2026-9907, CVE-2026-9908, CVE-2026-9909, CVE-2026-9910, CVE-2026-9911, CVE-2026-9912, CVE-2026-9913, CVE-2026-9914, CVE-2026-9915, CVE-2026-9916, CVE-2026-9917, CVE-2026-9918, CVE-2026-9919, CVE-202

chromium -- security fixesentered 2026-05-08

CVE-2026-7896, CVE-2026-7897, CVE-2026-7898, CVE-2026-7899, CVE-2026-7900, CVE-2026-7901, CVE-2026-7902, CVE-2026-7903, CVE-2026-7904, CVE-2026-7905, CVE-2026-7906, CVE-2026-7907, CVE-2026-7908, CVE-2026-7909, CVE-2026-7910, CVE-2026-7911, CVE-2026-7912, CVE-2026-7913, CVE-2026-7914, CVE-2026-7915, CVE-2026-7916, CVE-2026-7917, CVE-2026-7918, CVE-2026-7919, CVE-2026-7920, CVE-2026-7921, CVE-2026-7922, CVE-2026-7923, CVE-2026-7924, CVE-2026-7925, CVE-2026-7926, CVE-2026-7927, CVE-2026-7928, CVE-2026-7929, CVE-2026-7930, CVE-2026-7931, CVE-2026-7932, CVE-2026-7933, CVE-2026-7934, CVE-2026-7935, CVE-2026-7936, CVE-2026-7937, CVE-2026-7938, CVE-2026-7939, CVE-2026-7940, CVE-2026-7941, CVE-2026-7942, CVE-2026-7943, CVE-2026-7944, CVE-2026-7945, CVE-2026-7946, CVE-2026-7947, CVE-2026-7948, CVE-2026-7949, CVE-2026-7950, CVE-2026-7951, CVE-2026-7952, CVE-2026-7953, CVE-2026-7954, CVE-2026-7955, CVE-2026-7956, CVE-2026-7957, CVE-2026-7958, CVE-2026-7959, CVE-2026-7960, CVE-2026-7961, CVE-2026-7962, CVE-2026-7963, CVE-2026-7964, CVE-2026-7965, CVE-2026-7966, CVE-2026-7967, CVE-2026-7968, CV

chromium -- security fixesentered 2026-04-16

CVE-2026-6296, CVE-2026-6297, CVE-2026-6298, CVE-2026-6299, CVE-2026-6300, CVE-2026-6301, CVE-2026-6302, CVE-2026-6303, CVE-2026-6304, CVE-2026-6305, CVE-2026-6306, CVE-2026-6307, CVE-2026-6308, CVE-2026-6309, CVE-2026-6310, CVE-2026-6311, CVE-2026-6312, CVE-2026-6313, CVE-2026-6314, CVE-2026-6315, CVE-2026-6316, CVE-2026-6317, CVE-2026-6318, CVE-2026-6319, CVE-2026-6358, CVE-2026-6359, CVE-2026-6360, CVE-2026-6361, CVE-2026-6362, CVE-2026-6363, CVE-2026-6364

chromium -- security fixesentered 2026-04-10

CVE-2026-5858, CVE-2026-5859, CVE-2026-5860, CVE-2026-5861, CVE-2026-5862, CVE-2026-5863, CVE-2026-5864, CVE-2026-5865, CVE-2026-5866, CVE-2026-5867, CVE-2026-5868, CVE-2026-5869, CVE-2026-5870, CVE-2026-5871, CVE-2026-5872, CVE-2026-5873, CVE-2026-5874, CVE-2026-5875, CVE-2026-5876, CVE-2026-5877, CVE-2026-5878, CVE-2026-5879, CVE-2026-5880, CVE-2026-5881, CVE-2026-5882, CVE-2026-5883, CVE-2026-5884, CVE-2026-5885, CVE-2026-5886, CVE-2026-5887, CVE-2026-5888, CVE-2026-5889, CVE-2026-5890, CVE-2026-5891, CVE-2026-5892, CVE-2026-5893, CVE-2026-5894, CVE-2026-5895, CVE-2026-5896, CVE-2026-5897, CVE-2026-5898, CVE-2026-5899, CVE-2026-5900, CVE-2026-5901, CVE-2026-5902, CVE-2026-5903, CVE-2026-5904, CVE-2026-5905, CVE-2026-5906, CVE-2026-5907, CVE-2026-5908, CVE-2026-5909, CVE-2026-5910, CVE-2026-5911, CVE-2026-5912, CVE-2026-5913, CVE-2026-5914, CVE-2026-5915, CVE-2026-5918, CVE-2026-5919

CVE-2020-27844, CVE-2021-21159, CVE-2021-21160, CVE-2021-21161, CVE-2021-21162, CVE-2021-21163, CVE-2021-21164, CVE-2021-21165, CVE-2021-21166, CVE-2021-21167, CVE-2021-21168, CVE-2021-21169, CVE-2021-21170, CVE-2021-21171, CVE-2021-21172, CVE-2021-21173, CVE-2021-21174, CVE-2021-21175, CVE-2021-21176, CVE-2021-21177, CVE-2021-21178, CVE-2021-21179, CVE-2021-21180, CVE-2021-21181, CVE-2021-21182, CVE-2021-21183, CVE-2021-21184, CVE-2021-21185, CVE-2021-21186, CVE-2021-21187, CVE-2021-21188, CVE-2021-21189, CVE-2021-21190

CVE-2018-4117, CVE-2018-6044, CVE-2018-6150, CVE-2018-6151, CVE-2018-6152, CVE-2018-6153, CVE-2018-6154, CVE-2018-6155, CVE-2018-6156, CVE-2018-6157, CVE-2018-6158, CVE-2018-6159, CVE-2018-6160, CVE-2018-6161, CVE-2018-6162, CVE-2018-6163, CVE-2018-6164, CVE-2018-6165, CVE-2018-6166, CVE-2018-6167, CVE-2018-6168, CVE-2018-6169, CVE-2018-6170, CVE-2018-6171, CVE-2018-6172, CVE-2018-6173, CVE-2018-6174, CVE-2018-6175, CVE-2018-6176, CVE-2018-6177, CVE-2018-6178, CVE-2018-6179

chromium -- vulnerabilityentered 2018-04-24

CVE-2018-6084, CVE-2018-6085, CVE-2018-6086, CVE-2018-6087, CVE-2018-6088, CVE-2018-6089, CVE-2018-6090, CVE-2018-6091, CVE-2018-6092, CVE-2018-6093, CVE-2018-6094, CVE-2018-6095, CVE-2018-6096, CVE-2018-6097, CVE-2018-6098, CVE-2018-6099, CVE-2018-6100, CVE-2018-6101, CVE-2018-6102, CVE-2018-6103, CVE-2018-6104, CVE-2018-6105, CVE-2018-6106, CVE-2018-6107, CVE-2018-6108, CVE-2018-6109, CVE-2018-6110, CVE-2018-6111, CVE-2018-6112, CVE-2018-6113, CVE-2018-6114, CVE-2018-6115, CVE-2018-6116, CVE-2018-6117

Problem reports (15) · open in Bugzilla, most recently changed first

PRSummaryStatusChanged
300113maintainer-feedback? www/chromium: hang after selecting a drop-down in chrome browserNew2026-10-27
298960maintainer-feedback? www/chromium 154.0.8037.57 build failureNew2026-10-26
298988maintainer-feedback? www/chromium: chromedriver leaks its listening socket into Chrome; helper processes outlive the browser and keep the port boundNew2026-09-30
298780maintainer-feedback? www/chromium: plist issuesNew2026-09-23
254564maintainer-feedback? www/chromium: wrong dependency to libkrb5Open2026-09-23
Show all 15
PRSummaryStatusChanged
294933maintainer-feedback? www/chromium: re-enable zygotesOpen2026-07-19
269234maintainer-feedback? www/chromium: Sandboxing cleanup and basic Capsicum support for renderer processesNew2026-05-20
292307maintainer-feedback? www/chromium fails to store passwords/autologinNew2026-01-09
292306maintainer-feedback? www/chromium fails to store passwords/autologinNew2026-01-09
291315maintainer-feedback? www/chromium: [Feature Request] Provide chromium alias for Chromium port and clarify executable namingNew2025-12-01
290851maintainer-feedback? www/chromium: emoji picker not workingNew2025-11-07
290718maintainer-feedback? www/chromium: micro stuttering when playing >=1080p60 videosNew2025-11-01
265180maintainer-feedback? www/chromium: actually use the system-installed ICUOpen2025-10-26
278821maintainer-feedback? www/chromium: experiencing audio distortion when using webrtc and Universal Audio Volt 176 interfaceNew2025-09-17
280733maintainer-feedback? www/chromium: web serial api access is disabledNew2024-08-10

Commits (878)

Rene Ladan (rene) · 97.0.4692.99
www/chromium: update to 97.0.4692.99

Note that the port is currently broken on i386 as it does not compile there.
Security:	https://vuxml.freebsd.org/freebsd/51496cbc-7a0e-11ec-a323-3065ec8fd3ec.html
Security:	https://vuxml.freebsd.org/freebsd/9eeccbf3-6e26-11ec-bb10-3065ec8fd3ec.html
Security:	https://vuxml.freebsd.org/freebsd/fb9ba490-5cc4-11ec-aac7-3065ec8fd3ec.html
Security:	https://vuxml.freebsd.org/freebsd/18ac074c-579f-11ec-aac7-3065ec8fd3ec.html
Security:	https://vuxml.freebsd.org/freebsd/b8c0cbca-472d-11ec-83dc-3065ec8fd3ec.html
Security:	https://vuxml.freebsd.org/freebsd/976d7bf9-38ea-11ec-b3b0-3065ec8fd3ec.html
Security:	https://vuxml.freebsd.org/freebsd/bdaecfad-3117-11ec-b3b0-3065ec8fd3ec.html
aa70a996ea
Mariusz Zaborski (oshogbo) · 94.0.4606.81_3
www/chromium: fix obtaining HOST_NAME_MAX

Using sysconf(3) API lead to accidental introduction of variable length arrays
(VLA) in the port. Additionally gethostname(3) has been passed _SC_HOST_NAME_MAX
incorrectly as the HOST_NAME_MAX length.

Fall back to using _POSIX_HOST_NAME_MAX as the remaining code is not ready for
introducing sysconf(3) as a patch.

Bump PORTREVISION to rebuild with the new patch.

Reviewed by:	bapt
Sponsored by:	Fudo Security
Differential Revision:	https://reviews.freebsd.org/D30062
a33ecd73b4
Tobias Kortkamp (tobik) · 94.0.4606.81_2
*: Clean up some things

- Fix typos
- Remove unreferenced variables
- Sort categories
- Clean up commented PORTREVISION
- Fix broken syntax

Reported by:	portscan
feb95d6a41
Yuri Victorovich (yuri) · 94.0.4606.81_2
devel/jsoncpp: Update to 1.9.4 -> 1.9.5

PR:		259654
00f2a7aec7
Jan Beich (jbeich) · 94.0.4606.81_1
devel/icu: update to 70.1

Changes:	https://github.com/unicode-org/icu/releases/tag/release-70-1
Reported by:	GitHub (watch releases)
PR:		258794
Exp-run by:	antoine
f34ece3aa6
Rene Ladan (rene) · 94.0.4606.81
www/chromium: update to 94.0.4606.81

MFH:		2021Q4
Security:	https://vuxml.freebsd.org/freebsd/a7732806-0b2a-11ec-836b-3065ec8fd3ec.html
Security:	https://vuxml.freebsd.org/freebsd/47b571f2-157b-11ec-ae98-704d7b472482.html
Security:	https://vuxml.freebsd.org/freebsd/3551e106-1b17-11ec-a8a7-704d7b472482.html
Security:	https://vuxml.freebsd.org/freebsd/b6c875f1-1d76-11ec-ae80-704d7b472482.html
Security:	https://vuxml.freebsd.org/freebsd/777edbbe-2230-11ec-8869-704d7b472482.html
Security:	https://vuxml.freebsd.org/freebsd/7d3d94d3-2810-11ec-9c51-3065ec8fd3ec.html
336f302a55
Baptiste Daroussin (bapt) · 92.0.4515.159_2
INSTALLS_ICONS: retire the macro and rework the related dependencies

While here, make sure gtk-update-icon-cache is only on run dependency
where added as a dependency
Enforce gtk3 to depend on gtk-update-icon-cache (previously it was
inheriting the dependency)
2c672a4de9
Rene Ladan (rene) · 92.0.4515.159_2
cleanup: drop support for EOL FreeBSD 11.X

Search criteria used:
- 11.4
- OSREL*
- OSVER*
- *_FreeBSD_11

Input from:
- adridg: devel/qca-legacy
- jbeich: _WITH_DPRINTF, _WITH_GETLINE, GNU bfd workarounds
- sunpoet: security/p5-*OpenSSL*

Reviewed by:	doceng, kde, multimedia, perl, python, ruby, rust
Differential Revision: https://reviews.freebsd.org/D32008
Test Plan: make index
620968a43a
Joseph Mingrone (jrm) · 92.0.4515.159_2
www/chromium: Tweak mempcpy check to silence a warning

PR:		258271
289869de6a
Jan Beich (jbeich) · 92.0.4515.159_2
www/chromium: unbreak after dbc5f433f858

../../third_party/skia/src/pdf/SkPDFSubsetFont.cpp:74:5: error: use of undeclared identifier 'hb_subset_input_set_retain_gids'; did you mean 'hb_subset_input_set_flags'?
    hb_subset_input_set_retain_gids(input.get(), true);
    ^~~~~~~~~~~~~~~~~~~~~~~~~~~~~~~
    hb_subset_input_set_flags
/usr/local/include/harfbuzz/hb-subset.h:142:1: note: 'hb_subset_input_set_flags' declared here
hb_subset_input_set_flags (hb_subset_input_t *input,
^
../../third_party/skia/src/pdf/SkPDFSubsetFont.cpp:77:5: error: use of undeclared identifier 'hb_subset_input_set_drop_hints'
    hb_subset_input_set_drop_hints(input.get(), false);
    ^
../../third_party/skia/src/pdf/SkPDFSubsetFont.cpp:78:19: error: use of undeclared identifier 'hb_subset'; did you mean 'hb_set_set'?
    HBFace subset(hb_subset(face.get(), input.get()));
                  ^~~~~~~~~
                  hb_set_set
/usr/local/include/harfbuzz/hb-set.h:131:1: note: 'hb_set_set' declared here
hb_set_set (hb_set_t       *set,
^
../../third_party/skia/src/pdf/SkPDFSubsetFont.cpp:78:29: error: cannot initialize a parameter of type 'hb_set_t *' with an rvalue of type 'std::__1::unique_ptr<hb_face_t, SkFunctionWrapper<void (hb_face_t *), &hb_face_destroy>>::pointer' (aka 'hb_face_t *')
    HBFace subset(hb_subset(face.get(), input.get()));
                            ^~~~~~~~~~
/usr/local/include/harfbuzz/hb-set.h:131:29: note: passing argument to parameter 'set' here
hb_set_set (hb_set_t       *set,
                            ^

PR:		258576
Reported by:	pkg-fallout, Stefan Ehmann
Obtained from:	Arch Linux
17218fbbe7
Dmitry Marakasov (amdmi3) · 92.0.4515.159_1
www/chromium: mark as not compatible with python 3.10
5e5130e294
Rene Ladan (rene) · 92.0.4515.159_1
www/chromium: bump PORTREVISION for previous commits

MFH:		2021Q3
934d443a76
Rene Ladan (rene) · 92.0.4515.159
www/chromium: fix build on aarch64 (RPI4)

... by respecting LTO_VARS=off and exlcuding LTO from aarch64

PR:	257468
MFH:	2021Q3
447def6dd2
Rene Ladan (rene) · 92.0.4515.159
www/chromium: fix build on CURRENT

... after mempcpy(3) has been added to base libc.

PR:	257352
MFH:	2021Q3
9e6695a71d
Rene Ladan (rene) · 92.0.4515.159
www/chromium: update to 92.0.4515.159

Mark broken on i386 for now, it does not compile there because of a
ssize_t * vs off_t * mismatch.

MFH:		2021Q3
Security:	https://vuxml.freebsd.org/freebsd/128deba6-ff56-11eb-8514-3065ec8fd3ec.html
Security:	https://vuxml.freebsd.org/freebsd/c3c6c4a3-f47d-11eb-b632-3065ec8fd3ec.html
Security:	https://vuxml.freebsd.org/freebsd/76487640-ea29-11eb-a686-3065ec8fd3ec.html
76daa65324
Rene Ladan (rene) · 91.0.4472.164
www/chromium: Update to 91.0.4472.164

MFH:		2021Q3
Security:	https://vuxml.freebsd.org/freebsd/1ba21ff1-e672-11eb-a686-3065ec8fd3ec
f45bbe09ad
Kevin Bowling (kbowling) · 91.0.4472.114_1
graphics/mesa-libs: Bump reverse deps for libglvnd

Per discussion with bapt on helping pkg handle the changing of these
deps and avoiding impossible upgrade senarios.

PR:		246767
Reviewed by:	manu, bapt
Approved by:	x11
Differential Revision:	https://reviews.freebsd.org/D30824
da3162c7c9
Rene Ladan (rene) · 91.0.4472.114
www/chromium: update to 91.0.4472.114

MFH:		2021Q2
Security:	https://vuxml.freebsd.org/freebsd/afdc7579-d023-11eb-bcad-3065ec8fd3ec.html
d11be88745
Rene Ladan (rene) · 91.0.4472.106
www/chromium: update to 91.0.4472.106

This is a bugfix release, see
https://chromium.googlesource.com/chromium/src/+log/91.0.4472.101..91.0.4472.106?pretty=fuller&n=10000

While here remove the hardcoded dependency on virtual_oss.

MFH:		2021Q2
8c17a97d68
Rene Ladan (rene) · 91.0.4472.101
www/chromium: update to 91.0.4472.101

Security:	https://vuxml.freebsd.org/freebsd/20b3ab21-c9df-11eb-8558-3065ec8fd3ec.html
0631781523
Rene Ladan (rene) · 90.0.4430.212_1
www/chromium: attempt to make it work with Microsoft Teams

- add dependency virtual_oss so the microphone works [1]
- skip assertion in h264_decoder, we will force it to initialize
  later [2]

PR:	246214 [1]
PR:	255484 [2]
MFH:	2021Q2
74647995de
Rene Ladan (rene) · 90.0.4430.212
www/chromium: update to 90.0.4430.212

MFH:		2021Q2
Security:	https://vuxml.freebsd.org/freebsd/3cac007f-b27e-11eb-97a0-e09467587c17.html
ee49491174
Rene Ladan (rene) · 90.0.4430.93
www/chromium: add back patch for aarch64

MFH:		2021Q2
a0ca21b89d
Rene Ladan (rene) · 90.0.4430.93
www/chromium: update to 90.0.4430.93

MFH:		2021Q2
Security:	https://vuxml.freebsd.org/freebsd/9fba80e0-a771-11eb-97a0-e09467587c17.html
448693e731
Rene Ladan (rene) · 90.0.4430.85
www/chromium: mark BROKEN on 11/i386 for now
8ea13f9d59
Rene Ladan (rene) · 90.0.4430.85
www/chromium: update to 90.0.4430.85

Tested by:	Matthias Wolf, rene
MFH:		2021Q2
Security:	http://vuxml.freebsd.org/freebsd/cb13a765-a277-11eb-97a0-e09467587c17.html
be6259aac7
Rene Ladan (rene) · 89.0.4389.128
www/chromium: update to 89.0.4389.128

MFH:		2021Q2
Security:	http://vuxml.freebsd.org/freebsd/7c0d71a9-9d48-11eb-97a0-e09467587c17.html
a805b0a20e
Rene Ladan (rene) · 89.0.4389.114_1
www/chromium: pet portclippy
d8400d2cc3
Jan Beich (jbeich) · 89.0.4389.114_1
devel/icu: update to 69.1

Changes:	https://github.com/unicode-org/icu/releases/tag/release-69-1
Reported by:	GitHub (watch releases)
69d24a727d
Mathieu Arnold (mat) · 89.0.4389.114
all: Remove all other $FreeBSD keywords.
135fdeebb9
Rene Ladan (rene) · 89.0.4389.114
www/chromium: update to 89.0.4389.114

Submitted by:	Matthias Wolf via github
Security:	https://www.vuxml.org/freebsd/bddadaa4-9227-11eb-99c5-e09467587c17.html
1227b53ed1
Rene Ladan (rene) · 88.0.4324.182
www/chromium: some improvements for custom builds:

- enable link-time optimization (only for 13.0+ for now) [1]
- make Kerberos backend configurable (default unchanged) [2]

PR:		253628 [1]
PR:		254086 [2]
Submitted by:	iron.udjin@gmail.com [1]
Submitted by:	david@dcrosstech.com [2]
c2cd6ee7d7
Rene Ladan (rene) · 88.0.4324.182
www/chromium: update to 84.0.4324.182

MFH:		2021Q1
Security:	https://www.vuxml.org/freebsd/48514901-711d-11eb-9846-e09467587c17.html
ddcc28d70c
Mikael Urankar (mikael) · 88.0.4324.150
www/chromium: Fix build on aarch64

PR:		246982
Approved by:	portmgr (tier-2 blanket)
ab66938185
Rene Ladan (rene) · 88.0.4324.150
www/chromium: update to 88.0.4324.150

Security:	http://vuxml.freebsd.org/freebsd/3e01aad2-680e-11eb-83e2-e09467587c17.html
Security:	http://vuxml.freebsd.org/freebsd/479fdfda-6659-11eb-83e2-e09467587c17.html
5557257fb9
Sunpoet Po-Chuan Hsieh (sunpoet) · 88.0.4324.96_1
Bump PORTREVISION for devel/re2 shlib change
60321667ec
Rene Ladan (rene) · 88.0.4324.96
www/chromium: fix build when the VAAPI in multimedia/ffmpeg is switched off

PR:		253071
Submitted by:	george@m5p.com
MFH:		2021Q1
870abdfa92
Rene Ladan (rene) · 88.0.4324.96
www/chromium: update to 88.0.4324.96

Submitted by:	Matthias Wolf (via github)
MFH:		2021Q1
Security:	https://www.vuxml.org/freebsd/4ed0e43c-5cef-11eb-bafd-3065ec8fd3ec.html
a04e75e95a
Rene Ladan (rene) · 87.0.4280.141
www/chromium: update to 87.0.4280.141

Clean up now unused GN_ONLY code from Makefile
Security:	https://www.vuxml.org/freebsd/d153c4d2-50f8-11eb-8046-3065ec8fd3ec.html
391acded85
Conrad Meyer (cem) · 87.0.4280.88
www/chromium: Update to 87.0.4280.88

https://chromereleases.googleblog.com/2020/12/stable-channel-update-for-desktop.html

Changes: https://chromium.googlesource.com/chromium/src/+log/87.0.4280.67..87.0.4280.88?pretty=fuller&n=10000

Approved by:	jrm
Differential Revision:	https://reviews.freebsd.org/D27452
d817c0d07c
Antoine Brodin (antoine) · 87.0.4280.66
Unbreak INDEX
9749c01f0e
Joseph Mingrone (jrm) · 87.0.4280.66
www/chromium: Update to version 87.0.4280.66

Submitted by:	Matthias Wolf, cem, rene
Obtained from:	Some patches from OpenBSD port (robert@openbsd.org)
a0dbfe2fb0
Joseph Mingrone (jrm) · 85.0.4183.121_3
www/chromium: Make online detection always positive

Summary: navigator.onLine is currently broken in www/chromium. This change
introduce a workaround that always return positive for online detection.

Sponsored by:   The FreeBSD Foundation
Submitted by:	Ka Ho Ng <khng300@gmail.com>
Differential Revision:   https://reviews.freebsd.org/D26490
3c7c4cb53c
Mikael Urankar (mikael) · 85.0.4183.121_2
www/chromium: improve cpu features detection on aarch64

Approved by:	portmgr (tier-2 blanket)
adbc0f6151
Mikael Urankar (mikael) · 85.0.4183.121_2
www/chromium: attempt to fix build on aarch64

PR:		246982
Reported by:	Bob Prohaska
Approved by:	portmgr (tier-2 blanket)
9d7e951362
Jan Beich (jbeich) · 85.0.4183.121_2
devel/icu: update to 68.1

Changes:	http://site.icu-project.org/download/68
ABI:		https://abi-laboratory.pro/tracker/timeline/icu4c/
Reported by:	GitHub (watch releases)
6d5d6429d5
Joseph Mingrone (jrm) · 85.0.4183.121_1
www/chromium: Use SNDIO instead of ALSA for audio by default

There are stuttering sound issues when using ALSA, so switch to something
that works.

PR:		250370
288df69b89
Joseph Mingrone (jrm) · 85.0.4183.121
www/chromium: Update to version 85.0.4183.121

Submitted by:	cem, rene
Obtained from:	some patches from OpenBSD port
40c48efc97
Rene Ladan (rene) · 84.0.4147.135
www/chromium: drop pkg-message which was only useful for FreeBSD <= 11.2

Phabricator:	D26646
44c0d965a4
Jan Beich (jbeich) · 84.0.4147.135
www/chromium: unbreak with libglvnd

[188/188] LINK gn
ERROR at //build/config/linux/pkg_config.gni:103:17: Script returned non-zero exit code.
    pkgresult = exec_script(pkg_config_script, args, "value")
                ^----------
Package gbm was not found in the pkg-config search path.
Perhaps you should add the directory containing `gbm.pc'
to the PKG_CONFIG_PATH environment variable
Package 'gbm', required by 'virtual:world', not found
Could not run pkg-config.

See //third_party/minigbm/BUILD.gn:122:3: whence it was called.
  pkg_config("libgbm") {
  ^---------------------
See //ui/gfx/linux/BUILD.gn:41:5: which caused the file to be included.
    "//third_party/minigbm",
    ^----------------------
b1f3421492